Run of lintian-fixes for hdmi2usb-fx2-firmware

Try this locally (using the lintian-brush package):

debcheckout hdmi2usb-fx2-firmware
cd hdmi2usb-fx2-firmware
lintian-brush
641
642
643
644
645
646
647
648
649
650
651
652
653
654
655
656
sdcc -mmcs51  -I../include -c interrupts/sof_isr.c -o interrupts/sof_isr.rel
sdcc -mmcs51  -I../include -c interrupts/spare_isr.c -o interrupts/spare_isr.rel
sdcc -mmcs51  -I../include -c interrupts/sudav_isr.c -o interrupts/sudav_isr.rel
sdcc -mmcs51  -I../include -c interrupts/suspend_isr.c -o interrupts/suspend_isr.rel
sdcc -mmcs51  -I../include -c interrupts/sutok_isr.c -o interrupts/sutok_isr.rel
sdcc -mmcs51  -I../include -c interrupts/usbreset_isr.c -o interrupts/usbreset_isr.rel
sdas8051 -logs usbav.a51
sdcclib fx2.lib serial.rel i2c.rel delay.rel setupdat.rel gpif.rel eputils.rel interrupts/ep0ack_isr.rel interrupts/ep0in_isr.rel interrupts/ep0out_isr.rel interrupts/ep0ping_isr.rel interrupts/ep1in_isr.rel interrupts/ep1out_isr.rel interrupts/ep1ping_isr.rel interrupts/ep2_isr.rel interrupts/ep2ef_isr.rel interrupts/ep2ff_isr.rel interrupts/ep2isoerr_isr.rel interrupts/ep2pf_isr.rel interrupts/ep2ping_isr.rel interrupts/ep4_isr.rel interrupts/ep4ef_isr.rel interrupts/ep4ff_isr.rel interrupts/ep4isoerr_isr.rel interrupts/ep4pf_isr.rel interrupts/ep4ping_isr.rel interrupts/ep6_isr.rel interrupts/ep6ef_isr.rel interrupts/ep6ff_isr.rel interrupts/ep6isoerr_isr.rel interrupts/ep6pf_isr.rel interrupts/ep6ping_isr.rel interrupts/ep8_isr.rel interrupts/ep8ef_isr.rel interrupts/ep8ff_isr.rel interrupts/ep8isoerr_isr.rel interrupts/ep8pf_isr.rel interrupts/ep8ping_isr.rel interrupts/errlimit_isr.rel interrupts/gpifdone_isr.rel interrupts/gpifwf_isr.rel interrupts/hispeed_isr.rel interrupts/ibn_isr.rel interrupts/sof_isr.rel interrupts/spare_isr.rel interrupts/sudav_isr.rel interrupts/suspend_isr.rel interrupts/sutok_isr.rel interrupts/usbreset_isr.rel usbav.rel
/bin/bash: sdcclib: command not found
make[2]: *** [Makefile:29: fx2.lib] Error 127
make[2]: Leaving directory '/<<PKGBUILDDIR>>/lib'
make[1]: *** [Makefile:9: all] Error 2
make[1]: Leaving directory '/<<PKGBUILDDIR>>'
dh_auto_build: error: make -j32 "INSTALL=install --strip-program=true" returned exit code 2
make: *** [debian/rules:4: build] Error 25
dpkg-buildpackage: error: debian/rules build subprocess returned exit status 2

Summary

Full build log Full worker log