Run of fresh-releases for hiera-eyaml

Try this locally (using silver-platter):

debian-svp new-upstream hiera-eyaml 
1048
1049
1050
1051
1052
1053
1054
1055
1056
1057
1058
1059
1060
1061
1062
1063

┌──────────────────────────────────────────────────────────────────────────────┐
│ dh_ruby --install finished                                                   │
└──────────────────────────────────────────────────────────────────────────────┘

   dh_installdocs -O--buildsystem=ruby
   dh_ruby_fixdocs -O--buildsystem=ruby
   debian/rules override_dh_installchangelogs
make[1]: Entering directory '/<<PKGBUILDDIR>>'
dh_installchangelogs CHANGES.md
dh_installchangelogs: copy(CHANGES.md, debian/hiera-eyaml/usr/share/doc/hiera-eyaml/changelog): No such file or directory
dh_installchangelogs: Aborting due to earlier error
make[1]: *** [debian/rules:19: override_dh_installchangelogs] Error 255
make[1]: Leaving directory '/<<PKGBUILDDIR>>'
make: *** [debian/rules:15: binary] Error 2
dpkg-buildpackage: error: fakeroot debian/rules binary subprocess returned exit status 2

Summary

Merged new upstream version: 3.1.1 (was: 2.1.0).

Full build log Full worker log