Run of fresh-releases for jawn

Try this locally (using silver-platter):

debian-svp new-upstream jawn 
1
2
3
4
5
6
7
8
9
10
11
12
13
14
15
16
17
18
19
20
21
22
23
24
25
26
27
28
29
30
31
32
33
34
35
36
37
38
39
40
41
42
43
44
45
46
47
48
49
50
51
52
53
54
55
56
57
58
59
60
61
62
63
64
65
66
67
68
69
70
71
72
73
74
75
76
77
78
79
80
81
82
83
84
85
86
87
88
89
90
91
92
93
94
95
96
97
98
99
100
101
102
103
104
105
106
107
108
109
110
111
112
113
114
115
116
117
118
119
120
121
122
123
124
125
126
127
128
129
130
131
132
133
134
135
136
137
138
139
140
141
142
143
144
145
146
147
148
149
150
151
152
153
154
155
156
157
158
159
160
161
162
163
164
165
166
167
168
169
170
171
172
173
174
175
176
177
178
179
180
181
182
183
184
185
186
187
188
189
190
191
192
193
194
195
196
197
198
199
200
201
202
203
204
205
206
207
208
209
210
211
212
213
214
215
216
217
218
219
220
221
222
223
224
225
226
227
228
229
230
231
232
233
234
235
236
237
238
239
240
241
242
243
244
245
246
247
248
249
250
251
252
253
254
255
256
257
258
Processing: jawn
 42% (184/436)   
Total 436 (delta 140), reused 423 (delta 133)
/usr/lib/python3/dist-packages/debian/copyright.py:652: UserWarning: Fixing Format URL
  warnings.warn('Fixing Format URL')
Using upstream branch https://github.com/non/jawn (guessed)
Total 3016 (delta 15), reused 30 (delta 8), pack-reused 2976
Using version string 0.14.2.
No upstream upstream-revision format specified, trying tag:0.14.2
No upstream upstream-revision format specified, trying tag:jawn-0.14.2
No upstream upstream-revision format specified, trying tag:v0.14.2
Using uscan to look for the upstream tarball.
Total 2944 (delta 0), reused 0 (delta 0), pack-reused 2943

v0.10.3 does not point to a valid object
/usr/lib/python3/dist-packages/dulwich/repo.py:393: UserWarning: ref refs/tags/v0.10.1 points at non-present sha 0fc600e9f0b8b968686f5b3b26cb16864414a1f9
  UserWarning)
/usr/lib/python3/dist-packages/dulwich/repo.py:393: UserWarning: ref refs/tags/v0.8.1 points at non-present sha 138a95c2fe1ad64f9a81ce9a2ce5b9c286344b9d
  UserWarning)
/usr/lib/python3/dist-packages/dulwich/repo.py:393: UserWarning: ref refs/tags/v0.14.0 points at non-present sha 5314e6fb600419f26949c26a5affc4dbe7af193c
  UserWarning)
/usr/lib/python3/dist-packages/dulwich/repo.py:393: UserWarning: ref refs/tags/v0.7.0 points at non-present sha ef5d3fd98e8d9c802ac989e428a862be3a227c80
  UserWarning)
/usr/lib/python3/dist-packages/dulwich/repo.py:393: UserWarning: ref refs/tags/v0.7.2 points at non-present sha 3f811a0063d31dbb70e5ca03d66d5a42592100c1
  UserWarning)
/usr/lib/python3/dist-packages/dulwich/repo.py:393: UserWarning: ref refs/tags/v0.8.4 points at non-present sha f9d028a21b860697b5c099e7e14417dbbd18a556
  UserWarning)
/usr/lib/python3/dist-packages/dulwich/repo.py:393: UserWarning: ref refs/tags/v0.8.3 points at non-present sha 0030763eced3c8a45ab2da3c1df80d8bb2f26a6b
  UserWarning)
/usr/lib/python3/dist-packages/dulwich/repo.py:393: UserWarning: ref refs/tags/v0.10.2 points at non-present sha 0f71ba4517b599cff8f90acadd20246648d7646a
  UserWarning)
/usr/lib/python3/dist-packages/dulwich/repo.py:393: UserWarning: ref refs/tags/v0.13.0 points at non-present sha 9be6e7197789a97a4fc0395abeaa7a0c9e7ea4d8
  UserWarning)
/usr/lib/python3/dist-packages/dulwich/repo.py:393: UserWarning: ref refs/tags/v0.11.1 points at non-present sha e13fcebd1e654fdef273968baa319616ce7ff65d
  UserWarning)
/usr/lib/python3/dist-packages/dulwich/repo.py:393: UserWarning: ref refs/tags/v0.9.0 points at non-present sha 5822654ca1d19cdcac307921ebab295cfa26af61
  UserWarning)
/usr/lib/python3/dist-packages/dulwich/repo.py:393: UserWarning: ref refs/tags/v0.11.0 points at non-present sha 93a38d73fc86481f02e690fc448e0833ced0c70e
  UserWarning)
/usr/lib/python3/dist-packages/dulwich/repo.py:393: UserWarning: ref refs/tags/v0.7.1 points at non-present sha b8e8b450056b70053dd0b349a3f0c5ef0bc579bd
  UserWarning)
/usr/lib/python3/dist-packages/dulwich/repo.py:393: UserWarning: ref refs/tags/v0.10.0 points at non-present sha 47c0f07c1fcd224968b62c13cfe4473a881b67eb
  UserWarning)
/usr/lib/python3/dist-packages/dulwich/repo.py:393: UserWarning: ref refs/tags/v0.14.1 points at non-present sha 4fa27555b51f35a43008c24fd313c245c7e3a54a
  UserWarning)
/usr/lib/python3/dist-packages/dulwich/repo.py:393: UserWarning: ref refs/tags/v0.10.4 points at non-present sha 30c9ebc6c07fbe4a056f0c8a6304a6b1d35238b1
  UserWarning)
/usr/lib/python3/dist-packages/dulwich/repo.py:393: UserWarning: ref refs/tags/v0.8.2 points at non-present sha 9d1341666df0559c0ad8e1f07b298afe66b9e36d
  UserWarning)
/usr/lib/python3/dist-packages/dulwich/repo.py:393: UserWarning: ref refs/tags/v0.12.2 points at non-present sha ce933ddf8263106001187c31ed0fd39a3dc5be64
  UserWarning)
/usr/lib/python3/dist-packages/dulwich/repo.py:393: UserWarning: ref refs/tags/v0.8.0 points at non-present sha 8f8141d8a8a89b602b28cb2195cd2eb3ca6f4ba5
  UserWarning)
/usr/lib/python3/dist-packages/dulwich/repo.py:393: UserWarning: ref refs/tags/v0.12.0 points at non-present sha a2d15fbc2fd3302e017e017bd9311825771a20f5
  UserWarning)
/usr/lib/python3/dist-packages/dulwich/repo.py:393: UserWarning: ref refs/tags/v0.7.4 points at non-present sha 2f597799fdc79202f02ecae42c6785354a9466cb
  UserWarning)
/usr/lib/python3/dist-packages/dulwich/repo.py:393: UserWarning: ref refs/tags/v0.12.1 points at non-present sha d5ba8160e177e311be5870b652f1c1961f2da690
  UserWarning)
/usr/lib/python3/dist-packages/dulwich/repo.py:393: UserWarning: ref refs/tags/v0.6.0 points at non-present sha acc8482c03edec22cc1cf7b57f216415cdd1a615
  UserWarning)
Not storing pristine-tar metadata, since there is no pristine-tar branch.
/usr/lib/python3/dist-packages/dulwich/repo.py:393: UserWarning: ref refs/tags/v0.10.1 points at non-present sha 0fc600e9f0b8b968686f5b3b26cb16864414a1f9
  UserWarning)
/usr/lib/python3/dist-packages/dulwich/repo.py:393: UserWarning: ref refs/tags/v0.8.1 points at non-present sha 138a95c2fe1ad64f9a81ce9a2ce5b9c286344b9d
  UserWarning)
/usr/lib/python3/dist-packages/dulwich/repo.py:393: UserWarning: ref refs/tags/v0.14.0 points at non-present sha 5314e6fb600419f26949c26a5affc4dbe7af193c
  UserWarning)
/usr/lib/python3/dist-packages/dulwich/repo.py:393: UserWarning: ref refs/tags/v0.7.0 points at non-present sha ef5d3fd98e8d9c802ac989e428a862be3a227c80
  UserWarning)
/usr/lib/python3/dist-packages/dulwich/repo.py:393: UserWarning: ref refs/tags/v0.7.2 points at non-present sha 3f811a0063d31dbb70e5ca03d66d5a42592100c1
  UserWarning)
/usr/lib/python3/dist-packages/dulwich/repo.py:393: UserWarning: ref refs/tags/v0.8.4 points at non-present sha f9d028a21b860697b5c099e7e14417dbbd18a556
  UserWarning)
/usr/lib/python3/dist-packages/dulwich/repo.py:393: UserWarning: ref refs/tags/v0.8.3 points at non-present sha 0030763eced3c8a45ab2da3c1df80d8bb2f26a6b
  UserWarning)
/usr/lib/python3/dist-packages/dulwich/repo.py:393: UserWarning: ref refs/tags/v0.10.2 points at non-present sha 0f71ba4517b599cff8f90acadd20246648d7646a
  UserWarning)
/usr/lib/python3/dist-packages/dulwich/repo.py:393: UserWarning: ref refs/tags/v0.13.0 points at non-present sha 9be6e7197789a97a4fc0395abeaa7a0c9e7ea4d8
  UserWarning)
/usr/lib/python3/dist-packages/dulwich/repo.py:393: UserWarning: ref refs/tags/v0.11.1 points at non-present sha e13fcebd1e654fdef273968baa319616ce7ff65d
  UserWarning)
/usr/lib/python3/dist-packages/dulwich/repo.py:393: UserWarning: ref refs/tags/v0.9.0 points at non-present sha 5822654ca1d19cdcac307921ebab295cfa26af61
  UserWarning)
/usr/lib/python3/dist-packages/dulwich/repo.py:393: UserWarning: ref refs/tags/v0.11.0 points at non-present sha 93a38d73fc86481f02e690fc448e0833ced0c70e
  UserWarning)
/usr/lib/python3/dist-packages/dulwich/repo.py:393: UserWarning: ref refs/tags/v0.7.1 points at non-present sha b8e8b450056b70053dd0b349a3f0c5ef0bc579bd
  UserWarning)
/usr/lib/python3/dist-packages/dulwich/repo.py:393: UserWarning: ref refs/tags/v0.10.0 points at non-present sha 47c0f07c1fcd224968b62c13cfe4473a881b67eb
  UserWarning)
/usr/lib/python3/dist-packages/dulwich/repo.py:393: UserWarning: ref refs/tags/v0.14.1 points at non-present sha 4fa27555b51f35a43008c24fd313c245c7e3a54a
  UserWarning)
/usr/lib/python3/dist-packages/dulwich/repo.py:393: UserWarning: ref refs/tags/v0.10.4 points at non-present sha 30c9ebc6c07fbe4a056f0c8a6304a6b1d35238b1
  UserWarning)
/usr/lib/python3/dist-packages/dulwich/repo.py:393: UserWarning: ref refs/tags/v0.8.2 points at non-present sha 9d1341666df0559c0ad8e1f07b298afe66b9e36d
  UserWarning)
/usr/lib/python3/dist-packages/dulwich/repo.py:393: UserWarning: ref refs/tags/v0.12.2 points at non-present sha ce933ddf8263106001187c31ed0fd39a3dc5be64
  UserWarning)
/usr/lib/python3/dist-packages/dulwich/repo.py:393: UserWarning: ref refs/tags/v0.8.0 points at non-present sha 8f8141d8a8a89b602b28cb2195cd2eb3ca6f4ba5
  UserWarning)
/usr/lib/python3/dist-packages/dulwich/repo.py:393: UserWarning: ref refs/tags/v0.12.0 points at non-present sha a2d15fbc2fd3302e017e017bd9311825771a20f5
  UserWarning)
/usr/lib/python3/dist-packages/dulwich/repo.py:393: UserWarning: ref refs/tags/v0.7.4 points at non-present sha 2f597799fdc79202f02ecae42c6785354a9466cb
  UserWarning)
/usr/lib/python3/dist-packages/dulwich/repo.py:393: UserWarning: ref refs/tags/v0.12.1 points at non-present sha d5ba8160e177e311be5870b652f1c1961f2da690
  UserWarning)
/usr/lib/python3/dist-packages/dulwich/repo.py:393: UserWarning: ref refs/tags/v0.6.0 points at non-present sha acc8482c03edec22cc1cf7b57f216415cdd1a615
  UserWarning)
v0.10.1 does not point to a valid object
v0.8.1 does not point to a valid object
v0.14.0 does not point to a valid object
v0.7.0 does not point to a valid object
v0.7.2 does not point to a valid object
v0.8.4 does not point to a valid object
v0.8.3 does not point to a valid object
v0.10.2 does not point to a valid object
v0.13.0 does not point to a valid object
v0.11.1 does not point to a valid object
v0.9.0 does not point to a valid object
v0.11.0 does not point to a valid object
v0.7.1 does not point to a valid object
v0.10.0 does not point to a valid object
v0.14.1 does not point to a valid object
v0.10.4 does not point to a valid object
v0.8.2 does not point to a valid object
v0.12.2 does not point to a valid object
v0.14.2 does not point to a valid object
v0.8.0 does not point to a valid object
v0.12.0 does not point to a valid object
v0.7.4 does not point to a valid object
v0.12.1 does not point to a valid object
v0.6.0 does not point to a valid object
All changes applied successfully.
v0.10.1 does not point to a valid object
v0.8.1 does not point to a valid object
v0.14.0 does not point to a valid object
v0.7.0 does not point to a valid object
v0.7.2 does not point to a valid object
v0.8.4 does not point to a valid object
v0.8.3 does not point to a valid object
v0.10.2 does not point to a valid object
v0.13.0 does not point to a valid object
v0.11.1 does not point to a valid object
v0.9.0 does not point to a valid object
v0.11.0 does not point to a valid object
v0.7.1 does not point to a valid object
v0.10.0 does not point to a valid object
v0.14.1 does not point to a valid object
v0.10.4 does not point to a valid object
v0.8.2 does not point to a valid object
v0.12.2 does not point to a valid object
v0.14.2 does not point to a valid object
v0.8.0 does not point to a valid object
v0.12.0 does not point to a valid object
v0.7.4 does not point to a valid object
v0.12.1 does not point to a valid object
v0.6.0 does not point to a valid object
Committing to: /home/janitor/tmp/tmpxq3bwuoq/jawn/
modified .gitignore
modified .travis.yml
modified README.md
deleted ast/build.sbt
deleted ast/src/main/scala/jawn/Context.scala
deleted ast/src/main/scala/jawn/JParser.scala
deleted ast/src/main/scala/jawn/JValue.scala
deleted ast/src/main/scala/jawn/JawnFacade.scala
deleted ast/src/main/scala/jawn/Renderer.scala
deleted ast/src/main/scala/jawn/Run.scala
added ast/src/main/scala/jawn/ast
added ast/src/main/scala/jawn/ast/JParser.scala
added ast/src/main/scala/jawn/ast/JValue.scala
added ast/src/main/scala/jawn/ast/JawnFacade.scala
added ast/src/main/scala/jawn/ast/Renderer.scala
added ast/src/test/scala/jawn/ArbitraryUtil.scala
added ast/src/test/scala/jawn/AstTest.scala
modified ast/src/test/scala/jawn/ParseCheck.scala
modified benchmark/build.sbt
added benchmark/src/main/resources/countries.geo.json
added benchmark/src/main/resources/ugh10k.json
deleted benchmark/src/main/scala/jawn/AdHocBenchmarks.scala
deleted benchmark/src/main/scala/jawn/CaliperBenchmark.scala
added benchmark/src/main/scala/jawn/JmhBenchmarks.scala
deleted benchmark/src/main/scala/jawn/MyBenchmark.scala
modified benchmark/src/main/scala/jawn/Parboiled.scala
added benchmark/src/main/scala/jawn/ParseLongBench.scala
added build.sbt
modified debian/changelog
deleted parser/build.sbt
deleted parser/src/main/resources
deleted parser/src/main/resources/utf8.json
modified parser/src/main/scala/jawn/AsyncParser.scala
modified parser/src/main/scala/jawn/ByteBasedParser.scala
modified parser/src/main/scala/jawn/ByteBufferParser.scala
modified parser/src/main/scala/jawn/ChannelParser.scala
modified parser/src/main/scala/jawn/CharBasedParser.scala
modified parser/src/main/scala/jawn/CharBuilder.scala
added parser/src/main/scala/jawn/CharSequenceParser.scala
modified parser/src/main/scala/jawn/Facade.scala
modified parser/src/main/scala/jawn/MutableFacade.scala
modified parser/src/main/scala/jawn/NullFacade.scala
modified parser/src/main/scala/jawn/Parser.scala
modified parser/src/main/scala/jawn/SimpleFacade.scala
modified parser/src/main/scala/jawn/StringParser.scala
modified parser/src/main/scala/jawn/SupportParser.scala
modified parser/src/main/scala/jawn/SyncParser.scala
added parser/src/main/scala/jawn/Syntax.scala
added parser/src/test/scala/jawn/ChannelSpec.scala
added parser/src/test/scala/jawn/CharBuilderSpec.scala
added parser/src/test/scala/jawn/JNumIndexCheck.scala
modified parser/src/test/scala/jawn/SyntaxCheck.scala
added parser/src/test/scala/jawn/TestUtil.scala
deleted project/Build.scala
modified project/build.properties
modified project/plugins.sbt
deleted support/argonaut/build.sbt
modified support/argonaut/src/main/scala/Parser.scala
added support/argonaut/src/test
added support/argonaut/src/test/scala
added support/argonaut/src/test/scala/ParserSpec.scala
deleted support/json4s/build.sbt
modified support/json4s/src/main/scala/Parser.scala
deleted support/play/build.sbt
modified support/play/src/main/scala/Parser.scala
deleted support/rojoma/build.sbt
modified support/rojoma/src/main/scala/Parser.scala
deleted support/rojoma-v3/build.sbt
modified support/rojoma-v3/src/main/scala/Parser.scala
deleted support/spray/build.sbt
modified support/spray/src/main/scala/Parser.scala
added util
added util/src
added util/src/main
added util/src/main/scala
added util/src/main/scala/jawn
added util/src/main/scala/jawn/util
added util/src/main/scala/jawn/util/InvalidLong.scala
added util/src/main/scala/jawn/util/Slice.scala
added util/src/main/scala/jawn/util/package.scala
added util/src/test
added util/src/test/scala
added util/src/test/scala/jawn
added util/src/test/scala/jawn/util
added util/src/test/scala/jawn/util/ParseLongCheck.scala
added util/src/test/scala/jawn/util/SliceCheck.scala
modified version.sbt
Committed revision 19.
Worker failed: An error (1) occurred refreshing quilt patches: None

Applying patch debian/patches/01-java11-compatibility.patch
patching file parser/src/main/scala/jawn/AsyncParser.scala
Hunk #1 FAILED at 79.
1 out of 1 hunk FAILED -- rejects in file parser/src/main/scala/jawn/AsyncParser.scala
patching file parser/src/main/scala/jawn/ByteBufferParser.scala
Hunk #1 FAILED at 14.
1 out of 1 hunk FAILED -- rejects in file parser/src/main/scala/jawn/ByteBufferParser.scala
Patch debian/patches/01-java11-compatibility.patch does not apply (enforce with -f)

Elapsed time: 0:00:55.578496

Full worker log