Run of fresh-releases for libstax2-api-java

Try this locally (using silver-platter):

debian-svp new-upstream libstax2-api-java 
1927
1928
1929
1930
1931
1932
1933
1934
1935
1936
1937
1938
1939
1940
1941
1942
[INFO] ------------------------------------------------------------------------
[INFO] BUILD FAILURE
[INFO] ------------------------------------------------------------------------
[INFO] Total time:  0.586 s
[INFO] Finished at: 2019-08-15T15:52:42Z
[INFO] ------------------------------------------------------------------------
[ERROR] Error resolving version for plugin 'org.moditect:moditect-maven-plugin' from the repositories [local (/<<PKGBUILDDIR>>/debian/maven-repo), central (https://repo.maven.apache.org/maven2)]: Plugin not found in any plugin repository -> [Help 1]
[ERROR] 
[ERROR] To see the full stack trace of the errors, re-run Maven with the -e switch.
[ERROR] Re-run Maven using the -X switch to enable full debug logging.
[ERROR] 
[ERROR] For more information about the errors and possible solutions, please read the following articles:
[ERROR] [Help 1] http://cwiki.apache.org/confluence/display/MAVEN/PluginVersionResolutionException
dh_auto_build: /usr/lib/jvm/default-java/bin/java -noverify -cp /usr/share/maven/boot/plexus-classworlds-2.x.jar -Dmaven.home=/usr/share/maven -Dmaven.multiModuleProjectDirectory=/<<PKGBUILDDIR>> -Dclassworlds.conf=/etc/maven/m2-debian.conf org.codehaus.plexus.classworlds.launcher.Launcher -s/etc/maven/settings-debian.xml -Ddebian.dir=/<<PKGBUILDDIR>>/debian -Dmaven.repo.local=/<<PKGBUILDDIR>>/debian/maven-repo --batch-mode package -DskipTests -Dnotimestamp=true -Dlocale=en_US returned exit code 1
make: *** [debian/rules:10: build] Error 255
dpkg-buildpackage: error: debian/rules build subprocess returned exit status 2

Summary

Merged new upstream version: 4.2 (was: 4.1).

Full build log Full worker log