Run of fresh-releases for node-gulp-coffee

Try this locally (using silver-platter):

debian-svp new-upstream node-gulp-coffee 
1326
1327
1328
1329
1330
1331
1332
1333
1334
1335
1336
1337
1338
1339
1340
1341
    at Array.forEach (<anonymous>)
    at Mocha.loadFiles (/usr/lib/nodejs/mocha/lib/mocha.js:228:14)
    at Mocha.run (/usr/lib/nodejs/mocha/lib/mocha.js:536:10)
    at Object.<anonymous> (/usr/lib/nodejs/mocha/bin/_mocha:573:18)
    at Module._compile (internal/modules/cjs/loader.js:778:30)
    at Object.Module._extensions..js (internal/modules/cjs/loader.js:789:10)
    at Module.load (internal/modules/cjs/loader.js:653:32)
    at tryModuleLoad (internal/modules/cjs/loader.js:593:12)
    at Function.Module._load (internal/modules/cjs/loader.js:585:3)
    at Function.Module.runMain (internal/modules/cjs/loader.js:831:12)
    at startup (internal/bootstrap/node.js:283:19)
    at bootstrapNodeJSCore (internal/bootstrap/node.js:623:3)
make[1]: *** [debian/rules:13: override_dh_auto_test] Error 1
make[1]: Leaving directory '/<<PKGBUILDDIR>>'
make: *** [debian/rules:8: build] Error 2
dpkg-buildpackage: error: debian/rules build subprocess returned exit status 2

Summary

Merged new upstream version: 3.0.2 (was: 2.3.4).

Full build log (1) Full worker log