Run of fresh-snapshots for node-rollup-plugin-node-resolve

Try this locally (using silver-platter):

debian-svp new-upstream --snapshot node-rollup-plugin-node-resolve 
1249
1250
1251
1252
1253
1254
1255
1256
1257
1258
1259
1260
1261
1262
1263
1264
src/index.js → dist/rollup-plugin-node-resolve.cjs.js, dist/rollup-plugin-node-resolve.es.js...
[!] (babel plugin) Error: Couldn't find preset "@babel/preset-env" relative to directory "/<<PKGBUILDDIR>>/src"
src/index.js
Error: Couldn't find preset "@babel/preset-env" relative to directory "/<<PKGBUILDDIR>>/src"
    at error (/usr/lib/nodejs/rollup/dist/rollup.js:222:12)
    at Object.error$$1 [as error] (/usr/lib/nodejs/rollup/dist/rollup.js:6075:6)
    at /usr/lib/nodejs/rollup/dist/rollup.js:6084:28
    at process._tickCallback (internal/process/next_tick.js:68:7)
    at Function.Module.runMain (internal/modules/cjs/loader.js:745:11)
    at startup (internal/bootstrap/node.js:283:19)
    at bootstrapNodeJSCore (internal/bootstrap/node.js:743:3)

make[1]: *** [debian/rules:7: override_dh_auto_build] Error 1
make[1]: Leaving directory '/<<PKGBUILDDIR>>'
make: *** [debian/rules:4: build] Error 2
dpkg-buildpackage: error: debian/rules build subprocess returned exit status 2

Summary

Merged new upstream version: 5.2.0+git20190702.414fe34 (was: 4.2.3).

Full build log (1) Full worker log