Run of fresh-releases for tmux

Try this locally (using silver-platter):

debian-svp new-upstream tmux 
1
2
3
4
5
6
7
8
9
10
11
12
13
14
15
16
17
18
19
20
21
22
23
24
25
26
27
28
29
30
31
32
33
34
35
36
37
38
39
40
41
42
43
44
45
46
47
48
49
50
51
52
53
54
55
56
57
58
59
60
61
62
63
64
65
66
67
68
69
70
71
72
73
74
75
76
77
78
79
80
81
82
83
84
85
86
87
88
89
90
91
92
93
94
95
96
97
98
99
100
101
102
103
104
105
106
107
108
109
110
111
112
113
114
115
116
117
118
119
120
121
122
123
124
125
126
127
128
129
130
131
132
133
134
135
136
137
138
139
140
141
142
143
144
145
146
147
148
149
150
151
152
153
154
155
156
157
158
159
160
161
162
163
164
165
166
167
168
169
170
171
172
173
174
175
176
177
178
179
180
181
182
183
184
185
186
187
188
189
190
191
192
193
194
195
196
197
198
199
200
201
202
203
204
205
206
207
208
209
210
211
212
213
214
215
216
217
218
219
220
221
222
223
224
225
226
227
228
229
230
231
232
233
234
235
236
237
238
239
Processing: tmux
Total 5573 (delta 4401), reused 5342 (delta 4170)
Using upstream branch https://github.com/tmux/tmux (guessed)
)   
Total 37851 (delta 54), reused 88 (delta 50), pack-reused 37734
Using version string 3.0-rc3.
No upstream upstream-revision format specified, trying tag:3.0-rc3
No upstream upstream-revision format specified, trying tag:tmux-3.0-rc3
No upstream upstream-revision format specified, trying tag:v3.0-rc3
No upstream upstream-revision format specified, trying tag:v.3.0-rc3
Upstream version 3.0-rc3 is not in upstream branch <RemoteGitBranch('https://github.com/tmux/tmux/', 'master')>. Not merging from upstream branch. 
Using uscan to look for the upstream tarball.
uupdate: debian/source/format is "3.0 (quilt)".
uupdate: Auto-generating tmux_2.9a-2.debian.tar.xz
Total 37851 (delta 54), reused 88 (delta 50), pack-reused 37734
0.8 does not point to a valid object
0.9 does not point to a valid object
1.0 does not point to a valid object
1.1 does not point to a valid object
1.2 does not point to a valid object
1.3 does not point to a valid object
1.4 does not point to a valid object
1.5 does not point to a valid object
1.6 does not point to a valid object
/usr/lib/python3/dist-packages/dulwich/repo.py:393: UserWarning: ref refs/tags/2.8 points at non-present sha f21ecc05f801a4dfa971247824348c6fb89153db
  UserWarning)
/usr/lib/python3/dist-packages/dulwich/repo.py:393: UserWarning: ref refs/tags/1.9 points at non-present sha 7c2525de7342f8fa149f3c89c3493fb6d9224642
  UserWarning)
/usr/lib/python3/dist-packages/dulwich/repo.py:393: UserWarning: ref refs/tags/3.0 points at non-present sha 1a741808bfff317dbe94ffb8a343926584ae5f6a
  UserWarning)
/usr/lib/python3/dist-packages/dulwich/repo.py:393: UserWarning: ref refs/tags/1.8 points at non-present sha b0d95c1c0dc1b5fbfb80a3f640aba9172fc70808
  UserWarning)
/usr/lib/python3/dist-packages/dulwich/repo.py:393: UserWarning: ref refs/tags/2.3 points at non-present sha e34a3b13d0c011ea960922fddc78965c74257b89
  UserWarning)
/usr/lib/python3/dist-packages/dulwich/repo.py:393: UserWarning: ref refs/tags/2.9a points at non-present sha c8e3a5e3fb95ab318d7ce22a177aa44e1ea7afc4
  UserWarning)
/usr/lib/python3/dist-packages/dulwich/repo.py:393: UserWarning: ref refs/tags/2.2 points at non-present sha 31e704808afcaf1a5ba5bf65b8d5881154beb321
  UserWarning)
/usr/lib/python3/dist-packages/dulwich/repo.py:393: UserWarning: ref refs/tags/2.0 points at non-present sha a89a29c0101c016f281065a0e300bfcd6dd23e06
  UserWarning)
/usr/lib/python3/dist-packages/dulwich/repo.py:393: UserWarning: ref refs/tags/2.1 points at non-present sha bd20094b3d0bb0a27fe78c7a33ca319525d7b069
  UserWarning)
/usr/lib/python3/dist-packages/dulwich/repo.py:393: UserWarning: ref refs/tags/2.9 points at non-present sha b213f71b998f0d93ca3495ed6e619111f3b9adff
  UserWarning)
/usr/lib/python3/dist-packages/dulwich/repo.py:393: UserWarning: ref refs/tags/2.5 points at non-present sha 4a990ab9624176ad81a7a879a4e0613131bc3422
  UserWarning)
/usr/lib/python3/dist-packages/dulwich/repo.py:393: UserWarning: ref refs/tags/2.4 points at non-present sha b355a88f0efcc3d77930c3dd198d4cf24b84f1f3
  UserWarning)
/usr/lib/python3/dist-packages/dulwich/repo.py:393: UserWarning: ref refs/tags/1.7 points at non-present sha 7cd6faef9a2a79d018237c790d6d1ada1280eecf
  UserWarning)
/usr/lib/python3/dist-packages/dulwich/repo.py:393: UserWarning: ref refs/tags/2.6 points at non-present sha 39bd16ee20dc5be48695e6c467c06f225d0c6539
  UserWarning)
/usr/lib/python3/dist-packages/dulwich/repo.py:393: UserWarning: ref refs/tags/2.7 points at non-present sha abb9fa7ec5016cfda9d6ce066ce71184fb046894
  UserWarning)
/usr/lib/python3/dist-packages/dulwich/repo.py:393: UserWarning: ref refs/tags/1.9a points at non-present sha 234fc8b62c7313cb59c438d14be94bdfcd33ee79
  UserWarning)
Not storing pristine-tar metadata, since there is no pristine-tar branch.
/usr/lib/python3/dist-packages/dulwich/repo.py:393: UserWarning: ref refs/tags/2.8 points at non-present sha f21ecc05f801a4dfa971247824348c6fb89153db
  UserWarning)
/usr/lib/python3/dist-packages/dulwich/repo.py:393: UserWarning: ref refs/tags/1.9 points at non-present sha 7c2525de7342f8fa149f3c89c3493fb6d9224642
  UserWarning)
/usr/lib/python3/dist-packages/dulwich/repo.py:393: UserWarning: ref refs/tags/3.0 points at non-present sha 1a741808bfff317dbe94ffb8a343926584ae5f6a
  UserWarning)
/usr/lib/python3/dist-packages/dulwich/repo.py:393: UserWarning: ref refs/tags/1.8 points at non-present sha b0d95c1c0dc1b5fbfb80a3f640aba9172fc70808
  UserWarning)
/usr/lib/python3/dist-packages/dulwich/repo.py:393: UserWarning: ref refs/tags/2.3 points at non-present sha e34a3b13d0c011ea960922fddc78965c74257b89
  UserWarning)
/usr/lib/python3/dist-packages/dulwich/repo.py:393: UserWarning: ref refs/tags/2.9a points at non-present sha c8e3a5e3fb95ab318d7ce22a177aa44e1ea7afc4
  UserWarning)
/usr/lib/python3/dist-packages/dulwich/repo.py:393: UserWarning: ref refs/tags/2.2 points at non-present sha 31e704808afcaf1a5ba5bf65b8d5881154beb321
  UserWarning)
/usr/lib/python3/dist-packages/dulwich/repo.py:393: UserWarning: ref refs/tags/2.0 points at non-present sha a89a29c0101c016f281065a0e300bfcd6dd23e06
  UserWarning)
/usr/lib/python3/dist-packages/dulwich/repo.py:393: UserWarning: ref refs/tags/2.1 points at non-present sha bd20094b3d0bb0a27fe78c7a33ca319525d7b069
  UserWarning)
/usr/lib/python3/dist-packages/dulwich/repo.py:393: UserWarning: ref refs/tags/2.9 points at non-present sha b213f71b998f0d93ca3495ed6e619111f3b9adff
  UserWarning)
/usr/lib/python3/dist-packages/dulwich/repo.py:393: UserWarning: ref refs/tags/2.5 points at non-present sha 4a990ab9624176ad81a7a879a4e0613131bc3422
  UserWarning)
/usr/lib/python3/dist-packages/dulwich/repo.py:393: UserWarning: ref refs/tags/2.4 points at non-present sha b355a88f0efcc3d77930c3dd198d4cf24b84f1f3
  UserWarning)
/usr/lib/python3/dist-packages/dulwich/repo.py:393: UserWarning: ref refs/tags/1.7 points at non-present sha 7cd6faef9a2a79d018237c790d6d1ada1280eecf
  UserWarning)
/usr/lib/python3/dist-packages/dulwich/repo.py:393: UserWarning: ref refs/tags/2.6 points at non-present sha 39bd16ee20dc5be48695e6c467c06f225d0c6539
  UserWarning)
/usr/lib/python3/dist-packages/dulwich/repo.py:393: UserWarning: ref refs/tags/2.7 points at non-present sha abb9fa7ec5016cfda9d6ce066ce71184fb046894
  UserWarning)
/usr/lib/python3/dist-packages/dulwich/repo.py:393: UserWarning: ref refs/tags/1.9a points at non-present sha 234fc8b62c7313cb59c438d14be94bdfcd33ee79
  UserWarning)
2.8 does not point to a valid object
1.9 does not point to a valid object
3.0 does not point to a valid object
1.8 does not point to a valid object
2.3 does not point to a valid object
2.9a does not point to a valid object
2.2 does not point to a valid object
2.0 does not point to a valid object
2.1 does not point to a valid object
2.9 does not point to a valid object
2.5 does not point to a valid object
2.4 does not point to a valid object
1.7 does not point to a valid object
2.6 does not point to a valid object
2.7 does not point to a valid object
1.9a does not point to a valid object
All changes applied successfully.
2.8 does not point to a valid object
1.9 does not point to a valid object
3.0 does not point to a valid object
1.8 does not point to a valid object
2.3 does not point to a valid object
2.9a does not point to a valid object
2.2 does not point to a valid object
2.0 does not point to a valid object
2.1 does not point to a valid object
2.9 does not point to a valid object
2.5 does not point to a valid object
2.4 does not point to a valid object
1.7 does not point to a valid object
2.6 does not point to a valid object
2.7 does not point to a valid object
1.9a does not point to a valid object
Committing to: /home/janitor/tmp/tmpy3isa4v4/tmux/
modified CHANGES
modified COPYING
modified Makefile.am
modified Makefile.in
modified README
deleted TODO
modified arguments.c
modified attributes.c
modified cfg.c
modified client.c
modified cmd-attach-session.c
modified cmd-bind-key.c
modified cmd-command-prompt.c
modified cmd-confirm-before.c
modified cmd-copy-mode.c
added cmd-display-menu.c
modified cmd-display-message.c
modified cmd-display-panes.c
modified cmd-find.c
modified cmd-if-shell.c
modified cmd-join-pane.c
modified cmd-kill-session.c
modified cmd-list-keys.c
modified cmd-list.c
modified cmd-load-buffer.c
modified cmd-new-session.c
modified cmd-new-window.c
added cmd-parse.c
added cmd-parse.y
modified cmd-queue.c
modified cmd-resize-pane.c
modified cmd-respawn-pane.c
modified cmd-respawn-window.c
modified cmd-rotate-window.c
modified cmd-save-buffer.c
modified cmd-select-pane.c
modified cmd-select-window.c
modified cmd-send-keys.c
deleted cmd-set-hook.c
modified cmd-set-option.c
modified cmd-show-options.c
modified cmd-source-file.c
modified cmd-split-window.c
deleted cmd-string.c
modified cmd-swap-pane.c
modified cmd-swap-window.c
modified cmd-switch-client.c
modified cmd.c
deleted compat/fparseln.c
modified compat.h
modified configure
modified configure.ac
modified control-notify.c
modified control.c
modified debian/changelog
modified environ.c
added etc/ylwrap
modified example_tmux.conf
modified format-draw.c
modified format.c
modified grid.c
deleted hooks.c
modified input.c
modified key-bindings.c
modified layout-set.c
modified layout.c
added menu.c
modified mode-tree.c
modified notify.c
modified options-table.c
modified options.c
modified osdep-darwin.c
modified paste.c
modified resize.c
modified screen-redraw.c
modified screen-write.c
modified server-client.c
modified server-fn.c
modified server.c
modified session.c
added spawn.c
modified status.c
modified style.c
modified tmux.1
modified tmux.c
modified tmux.h
modified tty-acs.c
modified tty-keys.c
modified tty-term.c
modified tty.c
modified utf8.c
modified window-buffer.c
modified window-client.c
modified window-copy.c
modified window-tree.c
modified window.c
Committed revision 235.
Worker failed: An error (1) occurred refreshing quilt patches: None

Applying patch debian/patches/platform-quirks.diff
patching file compat.h
Hunk #2 succeeded at 236 (offset 1 line).
Refreshed patch debian/patches/platform-quirks.diff

Applying patch debian/patches/upstream-38b8a198bac6.diff
patching file layout-set.c
Hunk #1 FAILED at 185.
Hunk #2 FAILED at 195.
Hunk #3 FAILED at 221.
Hunk #4 FAILED at 269.
Hunk #5 FAILED at 279.
Hunk #6 FAILED at 305.
6 out of 6 hunks FAILED -- rejects in file layout-set.c
Patch debian/patches/upstream-38b8a198bac6.diff can be reverse-applied

Elapsed time: 0:02:18.325400

Full worker log