Run of fresh-snapshots for black

Try this locally (using silver-platter):

debian-svp new-upstream --snapshot black 
1
2
3
4
5
6
7
8
9
10
11
12
13
14
15
16
17
18
19
20
21
22
23
24
25
26
27
28
29
30
31
32
33
34
35
36
37
38
39
40
41
42
43
44
45
46
47
48
49
50
51
52
53
54
55
56
57
58
59
60
61
62
63
64
65
66
67
68
69
70
71
72
73
74
75
76
77
78
79
80
81
Processing: black
08)   
2% (161/308)   
Total 308 (delta 105), reused 245 (delta 56)

Total 0 (delta 0), reused 0 (delta 0)
/usr/lib/python3/dist-packages/pkginfo/develop.py:45: UserWarning: No PKG-INFO found for path: /home/janitor/tmp/tmpjdvsk6iw/black
  warnings.warn('No PKG-INFO found for path: %s' % self.path)
Using upstream branch https://github.com/ambv/black (guessed)
Total 2820 (delta 3), reused 4 (delta 2), pack-reused 2806
Using version string 19.3b0+git20190823.3dc461a.
Exporting upstream branch revision b'git-v1:3dc461a41a13cc36303aff80d079786ef210ddae' to create the tarball
Total 2820 (delta 3), reused 4 (delta 2), pack-reused 2806
Not storing pristine-tar metadata, since there is no pristine-tar branch.
All changes applied successfully.
Committing to: /home/janitor/tmp/tmpjdvsk6iw/black/
modified .appveyor.yml
modified .coveragerc
modified .flake8
added .gitattributes
modified .travis.yml
modified CONTRIBUTING.md
modified MANIFEST.in
modified Pipfile
modified Pipfile.lock
modified README.md
added _version.py
modified black.py
modified blackd.py
modified blib2to3/Grammar.txt
modified blib2to3/pgen2/driver.py
modified blib2to3/pgen2/grammar.py
modified blib2to3/pgen2/grammar.pyi
modified blib2to3/pgen2/token.py
modified blib2to3/pgen2/tokenize.py
modified blib2to3/pgen2/tokenize.pyi
modified blib2to3/pygram.py
modified blib2to3/pygram.pyi
modified blib2to3/pytree.py
modified debian/changelog
modified docs/conf.py
modified docs/environment.yml
modified mypy.ini
modified plugin/black.vim
modified pyproject.toml
modified setup.cfg
modified setup.py
added tests/data/async_as_identifier.py
added tests/data/beginning_backslash.py
modified tests/data/cantfit.py
added tests/data/comment_after_escaped_newline.py
modified tests/data/comments.py
modified tests/data/comments6.py
added tests/data/comments7.py
modified tests/data/composition.py
modified tests/data/expression.diff
modified tests/data/expression.py
added tests/data/function_trailing_comma.py
added tests/data/pep_570.py
added tests/data/pep_572.py
added tests/data/python2_print_function.py
modified tests/data/python37.py
added tests/data/remove_parens.py
modified tests/data/string_quotes.py
added tests/data/tupleassign.py
modified tests/test_black.py
added versioneer.py
Committed revision 28.
Worker failed: An error occurred refreshing quilt patch privacy-docs.diff: 

Applying patch debian/patches/privacy-docs.diff
patching file README.md
Hunk #1 FAILED at 4.
Hunk #2 FAILED at 917.
2 out of 2 hunks FAILED -- rejects in file README.md
patching file docs/conf.py
Hunk #2 FAILED at 165.
1 out of 2 hunks FAILED -- rejects in file docs/conf.py
Patch debian/patches/privacy-docs.diff does not apply (enforce with -f)

Elapsed time: 0:01:29.203986

Full worker log