Run of fresh-releases for caveexpress

Try this locally (using silver-platter):

debian-svp new-upstream caveexpress 
1
2
3
4
5
6
7
8
9
10
11
12
13
14
15
16
17
18
19
20
21
22
23
24
25
26
27
28
29
30
31
32
33
34
35
36
37
38
39
40
41
42
43
44
45
46
47
48
49
50
51
52
53
54
55
56
57
58
59
60
61
62
63
64
65
66
67
68
69
70
71
72
73
74
75
76
77
78
79
Processing: caveexpress
Total 0 (delta 0), reused 0 (delta 0)

Using upstream branch https://github.com/mgerhardy/caveexpress (guessed)
Total 42254 (delta 0), reused 0 (delta 0), pack-reused 42254
Using version string 2.5-dev2.
No upstream upstream-revision format specified, trying tag:2.5-dev2
Using uscan to look for the upstream tarball.
Total 40697 (delta 11), reused 11 (delta 11), pack-reused 40684
/usr/lib/python3/dist-packages/dulwich/repo.py:415: UserWarning: ref refs/tags/2.0 points at non-present sha b3c884e9b5948b199493491e2acad6719a826c06
  UserWarning)
/usr/lib/python3/dist-packages/dulwich/repo.py:415: UserWarning: ref refs/tags/1.8 points at non-present sha 957b074e4e749e77eb69b670e41100e7d47a8963
  UserWarning)
/usr/lib/python3/dist-packages/dulwich/repo.py:415: UserWarning: ref refs/tags/2.1 points at non-present sha 92c8807b5f1d831cc31a4a3ad1ae3a43b1c15974
  UserWarning)
/usr/lib/python3/dist-packages/dulwich/repo.py:415: UserWarning: ref refs/tags/2.1.1 points at non-present sha 1344e142b2595691dde42493a76fba3ee372b26d
  UserWarning)
/usr/lib/python3/dist-packages/dulwich/repo.py:415: UserWarning: ref refs/tags/1.6 points at non-present sha 5555571898af34402fd63f15f1d6067b5c9cfdaf
  UserWarning)
/usr/lib/python3/dist-packages/dulwich/repo.py:415: UserWarning: ref refs/tags/2.4 points at non-present sha c4207d322b0b3dca0f1bf83bb98277ea004d5700
  UserWarning)
/usr/lib/python3/dist-packages/dulwich/repo.py:415: UserWarning: ref refs/tags/2.0 points at non-present sha b3c884e9b5948b199493491e2acad6719a826c06
  UserWarning)
/usr/lib/python3/dist-packages/dulwich/repo.py:415: UserWarning: ref refs/tags/1.8 points at non-present sha 957b074e4e749e77eb69b670e41100e7d47a8963
  UserWarning)
/usr/lib/python3/dist-packages/dulwich/repo.py:415: UserWarning: ref refs/tags/2.1 points at non-present sha 92c8807b5f1d831cc31a4a3ad1ae3a43b1c15974
  UserWarning)
/usr/lib/python3/dist-packages/dulwich/repo.py:415: UserWarning: ref refs/tags/2.1.1 points at non-present sha 1344e142b2595691dde42493a76fba3ee372b26d
  UserWarning)
/usr/lib/python3/dist-packages/dulwich/repo.py:415: UserWarning: ref refs/tags/1.6 points at non-present sha 5555571898af34402fd63f15f1d6067b5c9cfdaf
  UserWarning)
/usr/lib/python3/dist-packages/dulwich/repo.py:415: UserWarning: ref refs/tags/2.4 points at non-present sha c4207d322b0b3dca0f1bf83bb98277ea004d5700
  UserWarning)
2.0 does not point to a valid object
1.8 does not point to a valid object
2.1 does not point to a valid object
2.1.1 does not point to a valid object
1.6 does not point to a valid object
2.4 does not point to a valid object
All changes applied successfully.
2.0 does not point to a valid object
1.8 does not point to a valid object
2.1 does not point to a valid object
2.1.1 does not point to a valid object
1.6 does not point to a valid object
2.4 does not point to a valid object
Committing to: /home/janitor/tmp/tmpp3lc2zac/caveexpress/
modified CMakeLists.txt
modified cmake/macros.cmake
modified cmake/toolchains/linux-toolchain.cmake
added contrib/assets/png-packed/exporter/HOWTO.md
deleted contrib/assets/png-packed/exporter/HOWTO.txt
modified contrib/installer/linux/caveexpress.6
modified contrib/installer/linux/cavepacker.6
modified contrib/installer/linux/desktop.in
modified debian/changelog
added docs/caveexpress/KEYWORDS
added docs/cavepacker/KEYWORDS
modified src/caveexpress/main/CMakeLists.txt
modified src/caveexpress/server/entities/IEntity.h
modified src/caveexpress/server/map/Map.cpp
modified src/cavepacker/main/CMakeLists.txt
modified src/modules/common/CMakeLists.txt
modified src/modules/common/FileSystem.cpp
modified src/modules/physics/Box2DMath.h
modified src/modules/physics/DebugRenderer.h
Committed revision 25.
Worker failed: An error occurred refreshing quilt patch build.patch: 

Applying patch debian/patches/build.patch
patching file CMakeLists.txt
Hunk #1 FAILED at 169.
1 out of 1 hunk FAILED -- rejects in file CMakeLists.txt
patching file cmake/macros.cmake
Hunk #1 FAILED at 128.
1 out of 1 hunk FAILED -- rejects in file cmake/macros.cmake
Patch debian/patches/build.patch does not apply (enforce with -f)

Elapsed time: 0:24:07.403732

Full worker log