Run of fresh-releases for ccextractor

Try this locally (using silver-platter):

debian-svp new-upstream ccextractor 
1
2
3
4
5
6
7
8
9
10
11
12
13
14
15
16
17
18
19
20
21
22
23
24
25
26
27
28
29
30
31
32
33
34
35
36
37
38
39
40
41
42
43
44
45
46
47
48
49
50
51
52
53
54
55
56
57
58
59
60
61
62
63
64
65
66
67
68
69
70
71
72
73
74
75
76
77
78
79
80
81
82
83
84
85
86
87
88
89
90
91
92
93
94
95
96
97
98
99
100
101
102
103
104
105
106
107
108
109
110
111
112
113
114
115
116
117
118
119
120
121
122
123
124
125
126
127
128
129
130
131
132
133
134
135
136
137
138
139
140
141
142
143
144
145
146
147
148
149
150
151
152
153
154
155
156
157
158
159
160
161
162
163
164
165
166
167
168
169
170
171
172
173
174
175
176
177
178
179
180
181
182
183
184
185
186
187
188
189
190
191
192
193
194
195
196
197
198
199
200
201
202
203
204
205
206
207
208
209
210
211
212
213
214
215
216
217
218
219
220
221
222
223
224
225
226
227
228
229
230
231
232
Processing: ccextractor
Total 0 (delta 0), reused 0 (delta 0)
Using upstream branch https://github.com/CCExtractor/ccextractor (guessed)
Total 14207 (delta 9), reused 8 (delta 3), pack-reused 14176
Using version string 0.88.
No upstream upstream-revision format specified, trying tag:0.88
No upstream upstream-revision format specified, trying tag:ccextractor-0.88
No upstream upstream-revision format specified, trying tag:v0.88
Using uscan to look for the upstream tarball.
uupdate: debian/source/format is "3.0 (quilt)".
uupdate: Auto-generating ccextractor_0.87+ds1-1.debian.tar.xz
uupdate: -> Copy to      ccextractor_0.88+ds1-1.debian.tar.xz
Total 14102 (delta 10), reused 10 (delta 10), pack-reused 14091

/usr/lib/python3/dist-packages/dulwich/repo.py:415: UserWarning: ref refs/tags/v0.74 points at non-present sha 0d25f940544841796c982c20a8d4aa17c6222ba0
  UserWarning)
/usr/lib/python3/dist-packages/dulwich/repo.py:415: UserWarning: ref refs/tags/v0.85 points at non-present sha bce3252f86b9314b7d63c44f97c0b8b2fe220d6b
  UserWarning)
/usr/lib/python3/dist-packages/dulwich/repo.py:415: UserWarning: ref refs/tags/v0.85b points at non-present sha dd42634e8ae525fa1034d5b5eb448c33ac90356f
  UserWarning)
/usr/lib/python3/dist-packages/dulwich/repo.py:415: UserWarning: ref refs/tags/v0.81 points at non-present sha d85f4fc2b45d1cf1e23696b7900662dc271b3cec
  UserWarning)
/usr/lib/python3/dist-packages/dulwich/repo.py:415: UserWarning: ref refs/tags/v0.76 points at non-present sha 2c37deca52d232056d6aabb2aec6680fd305010e
  UserWarning)
/usr/lib/python3/dist-packages/dulwich/repo.py:415: UserWarning: ref refs/tags/v0.82 points at non-present sha ece1141ccd64822cd4a1434841d1c39825bd5ea5
  UserWarning)
/usr/lib/python3/dist-packages/dulwich/repo.py:415: UserWarning: ref refs/tags/v0.75 points at non-present sha e3a0f664040e206935f19e814f1ef4ea25de0b1d
  UserWarning)
/usr/lib/python3/dist-packages/dulwich/repo.py:415: UserWarning: ref refs/tags/v0.71 points at non-present sha 8e0d973f24f649b644b2ee3f02fcde919a4825db
  UserWarning)
/usr/lib/python3/dist-packages/dulwich/repo.py:415: UserWarning: ref refs/tags/v0.78 points at non-present sha ad665113d1a96b22250031c42c8a529acbc321c3
  UserWarning)
/usr/lib/python3/dist-packages/dulwich/repo.py:415: UserWarning: ref refs/tags/v0.70 points at non-present sha 063c407a082c908f909415101ea54e51bf8f3b75
  UserWarning)
/usr/lib/python3/dist-packages/dulwich/repo.py:415: UserWarning: ref refs/tags/v0.79 points at non-present sha c76c3d4fab891dbfff0730bbb6957e08b2558b23
  UserWarning)
/usr/lib/python3/dist-packages/dulwich/repo.py:415: UserWarning: ref refs/tags/v0.73 points at non-present sha 7550a8bc9490182f18d02a8f4cb6610e17f5eaa4
  UserWarning)
/usr/lib/python3/dist-packages/dulwich/repo.py:415: UserWarning: ref refs/tags/v0.83 points at non-present sha af1756f11fe036b936d47046d835979ea1e1f630
  UserWarning)
/usr/lib/python3/dist-packages/dulwich/repo.py:415: UserWarning: ref refs/tags/v0.72 points at non-present sha 784d5d4c9404d34e3254318e60666dd5bda25870
  UserWarning)
/usr/lib/python3/dist-packages/dulwich/repo.py:415: UserWarning: ref refs/tags/v0.84 points at non-present sha 1124d0a5e333bd5fc24969ca8fef5b4ed6f1edac
  UserWarning)
/usr/lib/python3/dist-packages/dulwich/repo.py:415: UserWarning: ref refs/tags/v0.80 points at non-present sha f7f04508ebc9469c768fb1adb21de0e174ebf2ae
  UserWarning)
/usr/lib/python3/dist-packages/dulwich/repo.py:415: UserWarning: ref refs/tags/v0.77 points at non-present sha eba7a414bb147034f57e318c60b8667ad758f605
  UserWarning)
/usr/lib/python3/dist-packages/dulwich/repo.py:415: UserWarning: ref refs/tags/v0.74 points at non-present sha 0d25f940544841796c982c20a8d4aa17c6222ba0
  UserWarning)
/usr/lib/python3/dist-packages/dulwich/repo.py:415: UserWarning: ref refs/tags/v0.85 points at non-present sha bce3252f86b9314b7d63c44f97c0b8b2fe220d6b
  UserWarning)
/usr/lib/python3/dist-packages/dulwich/repo.py:415: UserWarning: ref refs/tags/v0.85b points at non-present sha dd42634e8ae525fa1034d5b5eb448c33ac90356f
  UserWarning)
/usr/lib/python3/dist-packages/dulwich/repo.py:415: UserWarning: ref refs/tags/v0.81 points at non-present sha d85f4fc2b45d1cf1e23696b7900662dc271b3cec
  UserWarning)
/usr/lib/python3/dist-packages/dulwich/repo.py:415: UserWarning: ref refs/tags/v0.76 points at non-present sha 2c37deca52d232056d6aabb2aec6680fd305010e
  UserWarning)
/usr/lib/python3/dist-packages/dulwich/repo.py:415: UserWarning: ref refs/tags/v0.82 points at non-present sha ece1141ccd64822cd4a1434841d1c39825bd5ea5
  UserWarning)
/usr/lib/python3/dist-packages/dulwich/repo.py:415: UserWarning: ref refs/tags/v0.75 points at non-present sha e3a0f664040e206935f19e814f1ef4ea25de0b1d
  UserWarning)
/usr/lib/python3/dist-packages/dulwich/repo.py:415: UserWarning: ref refs/tags/v0.71 points at non-present sha 8e0d973f24f649b644b2ee3f02fcde919a4825db
  UserWarning)
/usr/lib/python3/dist-packages/dulwich/repo.py:415: UserWarning: ref refs/tags/v0.78 points at non-present sha ad665113d1a96b22250031c42c8a529acbc321c3
  UserWarning)
/usr/lib/python3/dist-packages/dulwich/repo.py:415: UserWarning: ref refs/tags/v0.70 points at non-present sha 063c407a082c908f909415101ea54e51bf8f3b75
  UserWarning)
/usr/lib/python3/dist-packages/dulwich/repo.py:415: UserWarning: ref refs/tags/v0.79 points at non-present sha c76c3d4fab891dbfff0730bbb6957e08b2558b23
  UserWarning)
/usr/lib/python3/dist-packages/dulwich/repo.py:415: UserWarning: ref refs/tags/v0.73 points at non-present sha 7550a8bc9490182f18d02a8f4cb6610e17f5eaa4
  UserWarning)
/usr/lib/python3/dist-packages/dulwich/repo.py:415: UserWarning: ref refs/tags/v0.83 points at non-present sha af1756f11fe036b936d47046d835979ea1e1f630
  UserWarning)
/usr/lib/python3/dist-packages/dulwich/repo.py:415: UserWarning: ref refs/tags/v0.72 points at non-present sha 784d5d4c9404d34e3254318e60666dd5bda25870
  UserWarning)
/usr/lib/python3/dist-packages/dulwich/repo.py:415: UserWarning: ref refs/tags/v0.84 points at non-present sha 1124d0a5e333bd5fc24969ca8fef5b4ed6f1edac
  UserWarning)
/usr/lib/python3/dist-packages/dulwich/repo.py:415: UserWarning: ref refs/tags/v0.80 points at non-present sha f7f04508ebc9469c768fb1adb21de0e174ebf2ae
  UserWarning)
/usr/lib/python3/dist-packages/dulwich/repo.py:415: UserWarning: ref refs/tags/v0.77 points at non-present sha eba7a414bb147034f57e318c60b8667ad758f605
  UserWarning)
v0.74 does not point to a valid object
v0.85 does not point to a valid object
v0.85b does not point to a valid object
v0.81 does not point to a valid object
v0.76 does not point to a valid object
v0.82 does not point to a valid object
v0.75 does not point to a valid object
v0.71 does not point to a valid object
v0.78 does not point to a valid object
v0.70 does not point to a valid object
v0.79 does not point to a valid object
v0.73 does not point to a valid object
v0.83 does not point to a valid object
v0.72 does not point to a valid object
v0.84 does not point to a valid object
v0.80 does not point to a valid object
v0.77 does not point to a valid object
All changes applied successfully.
v0.74 does not point to a valid object
v0.85 does not point to a valid object
v0.85b does not point to a valid object
v0.81 does not point to a valid object
v0.76 does not point to a valid object
v0.82 does not point to a valid object
v0.75 does not point to a valid object
v0.71 does not point to a valid object
v0.78 does not point to a valid object
v0.70 does not point to a valid object
v0.79 does not point to a valid object
v0.73 does not point to a valid object
v0.83 does not point to a valid object
v0.72 does not point to a valid object
v0.84 does not point to a valid object
v0.80 does not point to a valid object
v0.77 does not point to a valid object
Committing to: /home/janitor/tmp/tmpkrk6dgp1/ccextractor/
modified .github/PULL_REQUEST_TEMPLATE.md
modified .gitignore
modified .travis.yml
modified OpenBSD/Makefile
modified README.md
modified debian/changelog
modified docs/AUTHORS.TXT
modified docs/CHANGES.TXT
modified docs/COMPILATION.MD
modified docs/OCR.md
added docs/img
added docs/img/Binaries.png
added docs/img/Building.png
added docs/img/ProjectSection.png
added docs/img/Properties.png
added docs/img/Warning.png
added docs/img/projectFiles.png
modified linux/Makefile.am
modified linux/build
modified linux/build_hardsubx
modified linux/builddebug
modified linux/configure.ac
modified mac/configure.ac
modified package_creators/PKGBUILD
modified package_creators/ccextractor.spec
modified package_creators/debian.sh
modified src/CMakeLists.txt
modified src/GUI/ccextractorGUI.c
modified src/GUI/file_browser.h
added src/GUI/icon_data.c
modified src/GUI/tabs.c
modified src/GUI/win_dirent.h
modified src/ccextractor.c
modified src/gpacmp4/av_parsers.c
modified src/gpacmp4/avc_ext.c
modified src/gpacmp4/bitstream.c
modified src/gpacmp4/box_code_drm.c
modified src/lib_ccx/asf_functions.c
modified src/lib_ccx/avc_functions.c
modified src/lib_ccx/cc_bitstream.c
modified src/lib_ccx/ccx_common_char_encoding.c
modified src/lib_ccx/ccx_common_constants.c
modified src/lib_ccx/ccx_common_option.c
modified src/lib_ccx/ccx_decoders_608.c
modified src/lib_ccx/ccx_decoders_708.c
modified src/lib_ccx/ccx_decoders_common.c
modified src/lib_ccx/ccx_decoders_isdb.c
modified src/lib_ccx/ccx_decoders_xds.c
modified src/lib_ccx/ccx_demuxer_mxf.c
modified src/lib_ccx/ccx_encoders_common.c
modified src/lib_ccx/ccx_encoders_common.h
modified src/lib_ccx/ccx_encoders_helpers.c
modified src/lib_ccx/ccx_encoders_smptett.c
modified src/lib_ccx/ccx_encoders_splitbysentence.c
modified src/lib_ccx/ccx_encoders_spupng.c
modified src/lib_ccx/ccx_encoders_srt.c
modified src/lib_ccx/ccx_gxf.c
modified src/lib_ccx/dvb_subtitle_decoder.c
modified src/lib_ccx/dvd_subtitle_decoder.c
modified src/lib_ccx/es_functions.c
modified src/lib_ccx/es_userdata.c
modified src/lib_ccx/file_functions.c
modified src/lib_ccx/general_loop.c
modified src/lib_ccx/hardsubx.c
modified src/lib_ccx/hardsubx.h
modified src/lib_ccx/lib_ccx.h
modified src/lib_ccx/matroska.c
modified src/lib_ccx/matroska.h
modified src/lib_ccx/networking.c
modified src/lib_ccx/networking.h
modified src/lib_ccx/ocr.c
modified src/lib_ccx/ocr.h
modified src/lib_ccx/params.c
modified src/lib_ccx/params_dump.c
modified src/lib_ccx/telxcc.c
modified src/lib_ccx/ts_info.c
modified src/lib_ccx/ts_tables.c
modified src/lib_ccx/ts_tables_epg.c
modified src/lib_ccx/wtv_functions.c
modified src/lib_hash/sha2.c
modified src/protobuf-c/protobuf-c.c
modified src/protobuf-c/protobuf-c.h
modified src/utf8proc/utf8proc.c
modified src/utf8proc/utf8proc.h
modified src/utf8proc/utf8proc_data.c
modified src/win_iconv/win_iconv.c
added tools/icons2c.c
Committed revision 26.
Worker failed: An error occurred refreshing quilt patch fix-typo.patch: 

Applying patch debian/patches/fix-typo.patch
patching file src/GUI/tabs.c
patching file src/gpacmp4/av_parsers.c
Hunk #1 FAILED at 3154.
1 out of 1 hunk FAILED -- rejects in file src/gpacmp4/av_parsers.c
patching file src/gpacmp4/avc_ext.c
patching file src/gpacmp4/descriptors.c
patching file src/lib_ccx/avc_functions.c
Hunk #1 FAILED at 838.
Hunk #2 FAILED at 849.
2 out of 2 hunks FAILED -- rejects in file src/lib_ccx/avc_functions.c
patching file src/lib_ccx/ccx_decoders_708.c
patching file src/lib_ccx/ccx_decoders_isdb.c
patching file src/lib_ccx/ccx_demuxer_mxf.c
Hunk #1 FAILED at 147.
1 out of 1 hunk FAILED -- rejects in file src/lib_ccx/ccx_demuxer_mxf.c
patching file src/lib_ccx/params.c
Hunk #1 succeeded at 2433 (offset 25 lines).
patching file src/lib_ccx/params_dump.c
Hunk #1 FAILED at 254.
1 out of 1 hunk FAILED -- rejects in file src/lib_ccx/params_dump.c
Patch debian/patches/fix-typo.patch does not apply (enforce with -f)

Elapsed time: 0:03:57.499881

Full worker log