Run of fresh-releases for cherrypy3

Try this locally (using silver-platter):

debian-svp new-upstream cherrypy3 
12
13
14
15
16
17
18
19
20
21
22
23
dpkg-source: info: using patch list from debian/patches/series
patching file docs/conf.py
Hunk #1 FAILED at 38.
1 out of 1 hunk FAILED
dpkg-source: info: the patch has fuzz which is not allowed, or is malformed
dpkg-source: info: if patch '0001-disable-sphinx-rst.linker-extension.patch' is correctly applied by quilt, use 'quilt refresh' to update it
dpkg-source: error: LC_ALL=C patch -t -F 0 -N -p1 -u -V never -E -b -B .pc/0001-disable-sphinx-rst.linker-extension.patch/ --reject-file=- < cherrypy3-18.6.0.orig.x59EH7/debian/patches/0001-disable-sphinx-rst.linker-extension.patch subprocess returned exit status 1
dpkg-source: info: using options from cherrypy3-18.6.0/debian/source/options: --extend-diff-ignore=^[^/]+\.egg-info/|cherrypy/test/.+\.log|cherrypy/test/static/has space.html
E: Failed to open build log /tmp/janitorpof3rf1q/build-area//tmp/janitorpof3rf1q/build-area/cherrypy3_18.6.0-1~jan+nur1.dsc_amd64-2021-04-24T10:10:56Z.build: No such file or directory
print() on closed filehandle $PLOG at /usr/share/perl5/Sbuild/Base.pm line 90.
E: unable to mktemp
brz: ERROR: The build failed.

Summary

Merged new upstream version: 18.6.0 (was: 8.9.1).

Full worker log Full build log