Run of fresh-snapshots for ctdconverter

Try this locally (using silver-platter):

debian-svp new-upstream --snapshot ctdconverter 
1
2
3
4
5
6
7
8
9
10
11
12
13
14
15
16
17
18
19
20
21
22
23
24
25
26
27
28
29
30
31
32
33
34
35
36
37
38
39
40
41
42
43
Processing: ctdconverter
7)   
Total 765 (delta 40), reused 725 (delta 0)
Total 0 (delta 0), reused 0 (delta 0)
Using upstream branch https://github.com/WorkflowConversion/CTDConverter (guessed)
Total 29 (delta 14), reused 14 (delta 10), pack-reused 3
Using version string 2.1+git20190607.c9d7d41.
No upstream upstream-revision format specified, trying git:c9d7d41
No upstream upstream-revision format specified, trying git:c9d7d41
Exporting upstream branch revision b'git-v1:c9d7d41c533e370c9aacce2da9a7d55ef4d20e80' to create the tarball
Total 29 (delta 14), reused 14 (delta 10), pack-reused 3
/usr/lib/python3/dist-packages/dulwich/repo.py:393: UserWarning: ref refs/tags/v1.1 points at non-present sha 8ad9678f00c831991b7ee9407d64dfdbf8bc2b04
  UserWarning)
Not storing pristine-tar metadata, since there is no pristine-tar branch.
/usr/lib/python3/dist-packages/dulwich/repo.py:393: UserWarning: ref refs/tags/v1.1 points at non-present sha 8ad9678f00c831991b7ee9407d64dfdbf8bc2b04
  UserWarning)
v1.1 does not point to a valid object
All changes applied successfully.
v1.1 does not point to a valid object
Committing to: /home/janitor/tmp/tmpdxx79p3n/ctdconverter/
modified LICENSE
modified README.md
modified common/utils.py
modified convert.py
modified debian/changelog
modified galaxy/converter.py
added setup.py
Committed revision 17.
Worker failed: An error (1) occurred refreshing quilt patches: None

Applying patch debian/patches/add_setup.py.patch
patching file convert.py
Hunk #1 FAILED at 8.
Hunk #2 FAILED at 269.
2 out of 2 hunks FAILED -- rejects in file convert.py
The next patch would create the file setup.py,
which already exists!  Applying it anyway.
patching file setup.py
Hunk #1 FAILED at 1.
1 out of 1 hunk FAILED -- rejects in file setup.py
Patch debian/patches/add_setup.py.patch does not apply (enforce with -f)

Elapsed time: 0:00:16.338486

Full worker log