Run of fresh-releases for cura-engine

Try this locally (using silver-platter):

debian-svp new-upstream cura-engine 
1
2
3
4
5
6
7
8
9
10
11
12
13
14
15
16
17
18
19
20
21
22
23
24
25
26
27
28
29
30
31
32
33
34
35
36
37
38
39
40
41
42
43
44
45
46
47
48
49
50
51
52
53
54
55
56
57
58
59
60
61
62
63
64
65
66
67
68
69
70
71
72
73
74
75
76
77
78
79
80
81
82
83
84
85
86
87
88
89
90
91
92
93
94
95
96
97
98
99
100
101
102
103
104
105
106
107
108
109
110
111
112
113
114
115
116
117
118
119
120
121
122
123
124
125
126
127
128
129
130
131
132
133
134
135
136
137
138
139
140
141
142
143
144
145
146
147
148
149
150
151
152
153
154
155
156
157
158
159
160
161
162
163
164
165
166
167
168
169
170
171
172
173
174
175
176
177
178
179
180
181
182
183
184
185
186
187
188
189
190
191
192
193
194
195
196
197
198
199
200
201
202
203
204
205
206
207
208
209
210
211
212
213
214
215
216
217
218
219
220
221
222
223
224
225
226
227
228
229
230
231
232
233
234
235
236
237
238
239
240
241
242
243
244
245
246
247
248
249
250
251
252
253
254
255
256
257
258
259
260
261
262
263
264
265
266
267
268
269
270
271
272
273
274
275
276
277
278
279
280
281
282
283
284
285
286
287
288
289
290
291
292
293
294
295
296
297
298
299
300
301
302
303
304
305
306
307
308
309
310
311
312
313
314
315
316
317
318
319
320
321
322
323
324
325
326
327
328
329
330
331
332
333
334
335
336
337
338
339
340
341
342
343
344
345
346
347
348
349
350
351
352
353
354
355
356
357
358
359
360
361
362
363
364
365
Processing: cura-engine
Total 0 (delta 0), reused 0 (delta 0)
/usr/lib/python3/dist-packages/debian/copyright.py:652: UserWarning: Fixing Format URL
  warnings.warn('Fixing Format URL')
Using upstream branch https://github.com/Ultimaker/CuraEngine (guessed)
Total 12000 (delta 3124), reused 3125 (delta 3124), pack-reused 8871
Using version string 4.2.0.
No upstream upstream-revision format specified, trying tag:4.2.0
Using uscan to look for the upstream tarball.
Total 11791 (delta 3099), reused 3099 (delta 3099), pack-reused 8690
3.4.1 does not point to a valid object
/usr/lib/python3/dist-packages/dulwich/repo.py:415: UserWarning: ref refs/tags/3.6.0 points at non-present sha dd2734b70a4e5038bb1fb81da1277f7f13ffdc55
  UserWarning)
/usr/lib/python3/dist-packages/dulwich/repo.py:415: UserWarning: ref refs/tags/3.5.1 points at non-present sha e1667f1389e4c323791e6265b44cc55a406f6fe4
  UserWarning)
/usr/lib/python3/dist-packages/dulwich/repo.py:415: UserWarning: ref refs/tags/4.0.0 points at non-present sha 35127b1978067c0ffa0644ac3bb06c87cce15821
  UserWarning)
/usr/lib/python3/dist-packages/dulwich/repo.py:415: UserWarning: ref refs/tags/4.1.0 points at non-present sha 43cb287283a446173e6e1fc4eb9e3e11413c397f
  UserWarning)
/usr/lib/python3/dist-packages/dulwich/repo.py:415: UserWarning: ref refs/tags/4.0-beta points at non-present sha e49093f00dc999c3d48324dead24e584f18afc62
  UserWarning)
/usr/lib/python3/dist-packages/dulwich/repo.py:415: UserWarning: ref refs/tags/3.6.0 points at non-present sha dd2734b70a4e5038bb1fb81da1277f7f13ffdc55
  UserWarning)
/usr/lib/python3/dist-packages/dulwich/repo.py:415: UserWarning: ref refs/tags/3.5.1 points at non-present sha e1667f1389e4c323791e6265b44cc55a406f6fe4
  UserWarning)
/usr/lib/python3/dist-packages/dulwich/repo.py:415: UserWarning: ref refs/tags/4.0.0 points at non-present sha 35127b1978067c0ffa0644ac3bb06c87cce15821
  UserWarning)
/usr/lib/python3/dist-packages/dulwich/repo.py:415: UserWarning: ref refs/tags/4.1.0 points at non-present sha 43cb287283a446173e6e1fc4eb9e3e11413c397f
  UserWarning)
/usr/lib/python3/dist-packages/dulwich/repo.py:415: UserWarning: ref refs/tags/4.0-beta points at non-present sha e49093f00dc999c3d48324dead24e584f18afc62
  UserWarning)
3.6.0 does not point to a valid object
3.5.1 does not point to a valid object
4.0.0 does not point to a valid object
4.1.0 does not point to a valid object
4.0-beta does not point to a valid object
All changes applied successfully.
3.6.0 does not point to a valid object
3.5.1 does not point to a valid object
4.0.0 does not point to a valid object
4.1.0 does not point to a valid object
4.0-beta does not point to a valid object
Committing to: /home/janitor/tmp/tmpwogw9emr/cura-engine/
modified .github/ISSUE_TEMPLATE.md
modified .gitignore
added .gitlab-ci.yml
modified CMakeLists.txt
modified Cura.proto
modified Jenkinsfile
modified README.md
added clang-format
added cmake/FindGMock.cmake
added cmake/FindStb.cmake
modified debian/changelog
added docker
added docker/build.sh
added docs/assets/box_model.svg
added docs/assets/connected_infill.svg
added docs/assets/gap_filled_compensated.svg
added docs/assets/gap_filled_joined.svg
added docs/assets/gap_filled_original.svg
added docs/assets/gaps_in_walls.svg
added docs/assets/insets.svg
added docs/assets/layer_heights.svg
added docs/assets/line_infill.svg
added docs/assets/overlap_compensation.svg
added docs/assets/preheat_insert.svg
added docs/assets/scene_structure.png
added docs/assets/skin_cross_sections.svg
added docs/assets/skin_overlaid.svg
added docs/assets/slice_triangle.svg
added docs/assets/stair_step_0.png
added docs/assets/stair_step_1.png
added docs/assets/stair_step_2.png
added docs/assets/stitching_cross.svg
added docs/assets/stitching_direction.svg
added docs/assets/stitching_open.svg
added docs/assets/support_basic.svg
added docs/assets/support_distance_formula.svg
added docs/assets/support_extended.svg
added docs/assets/support_min_distance.png
added docs/assets/support_no_distance.png
added docs/assets/support_xy_distance.png
added docs/assets/support_z_distance.png
added docs/assets/temperature_regulation.svg
added docs/assets/travel_avoidance.svg
added docs/assets/travel_combing.svg
added docs/concepts.md
added docs/gcode_export.md
added docs/generating_areas.md
added docs/generating_paths.md
modified docs/glossary.md
added docs/inserts.md
modified docs/mainpage.md
deleted docs/overview.md
added docs/pipeline.md
added docs/scene.md
added docs/settings.md
added docs/slicing.md
modified libs/clipper/License.txt
modified libs/clipper/README
modified libs/clipper/clipper.cpp
modified libs/clipper/clipper.hpp
modified meta/new settings master
added src/Application.cpp
added src/Application.h
modified src/ConicalOverhang.cpp
modified src/ConicalOverhang.h
modified src/ExtruderTrain.cpp
modified src/ExtruderTrain.h
modified src/FanSpeedLayerTime.h
modified src/FffGcodeWriter.cpp
modified src/FffGcodeWriter.h
modified src/FffPolygonGenerator.cpp
modified src/FffPolygonGenerator.h
modified src/FffProcessor.cpp
modified src/FffProcessor.h
deleted src/FlowTempGraph.h
modified src/GCodePathConfig.cpp
modified src/GCodePathConfig.h
modified src/GcodeLayerThreader.h
modified src/InsetOrderOptimizer.cpp
modified src/InsetOrderOptimizer.h
modified src/LayerPlan.cpp
modified src/LayerPlan.h
modified src/LayerPlanBuffer.cpp
modified src/LayerPlanBuffer.h
modified src/MergeInfillLines.cpp
modified src/MergeInfillLines.h
modified src/MeshGroup.cpp
modified src/MeshGroup.h
modified src/Mold.cpp
modified src/Mold.h
modified src/Preheat.cpp
modified src/Preheat.h
modified src/PrimeTower.cpp
modified src/PrimeTower.h
modified src/PrintFeature.h
modified src/RetractionConfig.h
added src/Scene.cpp
added src/Scene.h
modified src/SkirtBrim.cpp
modified src/SkirtBrim.h
added src/Slice.cpp
added src/Slice.h
modified src/SupportInfillPart.cpp
modified src/SupportInfillPart.h
modified src/TopSurface.cpp
modified src/TopSurface.h
modified src/TreeSupport.cpp
modified src/TreeSupport.h
modified src/WallsComputation.cpp
modified src/WallsComputation.h
modified src/Weaver.cpp
modified src/Weaver.h
added src/WipeScriptConfig.h
modified src/Wireframe2gcode.cpp
modified src/Wireframe2gcode.h
modified src/bridge.cpp
modified src/bridge.h
deleted src/commandSocket.cpp
deleted src/commandSocket.h
added src/communication
added src/communication/ArcusCommunication.cpp
added src/communication/ArcusCommunication.h
added src/communication/ArcusCommunicationPrivate.cpp
added src/communication/ArcusCommunicationPrivate.h
added src/communication/CommandLine.cpp
added src/communication/CommandLine.h
added src/communication/Communication.h
added src/communication/Listener.cpp
added src/communication/Listener.h
added src/communication/SliceDataStruct.h
modified src/gcodeExport.cpp
modified src/gcodeExport.h
added src/infill/DensityProvider.h
added src/infill/GyroidInfill.cpp
added src/infill/GyroidInfill.h
added src/infill/ImageBasedDensityProvider.cpp
added src/infill/ImageBasedDensityProvider.h
modified src/infill/NoZigZagConnectorProcessor.h
added src/infill/SierpinskiFill.cpp
added src/infill/SierpinskiFill.h
added src/infill/SierpinskiFillProvider.cpp
added src/infill/SierpinskiFillProvider.h
deleted src/infill/SpaceFillingTreeFill.cpp
deleted src/infill/SpaceFillingTreeFill.h
modified src/infill/SpaghettiInfill.cpp
modified src/infill/SpaghettiInfill.h
modified src/infill/SpaghettiInfillPathGenerator.cpp
modified src/infill/SpaghettiInfillPathGenerator.h
modified src/infill/SubDivCube.cpp
modified src/infill/SubDivCube.h
added src/infill/UniformDensityProvider.h
modified src/infill/ZigzagConnectorProcessor.cpp
modified src/infill/ZigzagConnectorProcessor.h
modified src/infill.cpp
modified src/infill.h
modified src/layerPart.cpp
modified src/layerPart.h
modified src/main.cpp
modified src/mesh.cpp
modified src/mesh.h
modified src/multiVolumes.cpp
modified src/multiVolumes.h
modified src/pathOrderOptimizer.cpp
modified src/pathOrderOptimizer.h
modified src/pathPlanning/Comb.cpp
modified src/pathPlanning/Comb.h
modified src/pathPlanning/CombPath.h
modified src/pathPlanning/GCodePath.cpp
modified src/pathPlanning/GCodePath.h
modified src/pathPlanning/LinePolygonsCrossings.cpp
modified src/pathPlanning/LinePolygonsCrossings.h
modified src/pathPlanning/NozzleTempInsert.cpp
modified src/pathPlanning/NozzleTempInsert.h
modified src/pathPlanning/TimeMaterialEstimates.h
modified src/progress/Progress.cpp
modified src/progress/Progress.h
modified src/raft.cpp
modified src/raft.h
modified src/settings/AdaptiveLayerHeights.cpp
modified src/settings/AdaptiveLayerHeights.h
added src/settings/EnumSettings.h
added src/settings/FlowTempGraph.cpp
added src/settings/FlowTempGraph.h
modified src/settings/PathConfigStorage.cpp
modified src/settings/PathConfigStorage.h
deleted src/settings/SettingConfig.cpp
deleted src/settings/SettingConfig.h
deleted src/settings/SettingContainer.cpp
deleted src/settings/SettingContainer.h
deleted src/settings/SettingRegistry.cpp
deleted src/settings/SettingRegistry.h
added src/settings/Settings.cpp
added src/settings/Settings.h
deleted src/settings/SettingsToGV.h
deleted src/settings/settings.cpp
deleted src/settings/settings.h
added src/settings/types
added src/settings/types/AngleDegrees.h
added src/settings/types/AngleRadians.h
added src/settings/types/Duration.h
added src/settings/types/LayerIndex.h
added src/settings/types/Ratio.h
added src/settings/types/Temperature.h
added src/settings/types/Velocity.h
modified src/skin.cpp
modified src/skin.h
modified src/sliceDataStorage.cpp
modified src/sliceDataStorage.h
modified src/slicer.cpp
modified src/slicer.h
modified src/support.cpp
modified src/support.h
modified src/timeEstimate.cpp
modified src/timeEstimate.h
modified src/utils/AABB.cpp
modified src/utils/AABB.h
modified src/utils/AABB3D.cpp
modified src/utils/AABB3D.h
added src/utils/Coord_t.h
added src/utils/IntPoint.h
modified src/utils/LinearAlg2D.cpp
modified src/utils/ListPolyIt.h
modified src/utils/MinimumSpanningTree.cpp
modified src/utils/MinimumSpanningTree.h
added src/utils/Point3.cpp
added src/utils/Point3.h
added src/utils/PolygonConnector.cpp
added src/utils/PolygonConnector.h
modified src/utils/PolygonProximityLinker.cpp
modified src/utils/PolygonProximityLinker.h
modified src/utils/PolygonsPointIndex.h
modified src/utils/ProximityPointLink.cpp
modified src/utils/ProximityPointLink.h
modified src/utils/SVG.cpp
modified src/utils/SVG.h
deleted src/utils/SpaceFillingTree.cpp
deleted src/utils/SpaceFillingTree.h
modified src/utils/SparseGrid.h
modified src/utils/SparseLineGrid.h
modified src/utils/SparsePointGrid.h
modified src/utils/SparsePointGridInclusive.h
modified src/utils/floatpoint.h
added src/utils/getpath.cpp
added src/utils/getpath.h
modified src/utils/gettime.h
deleted src/utils/intpoint.h
modified src/utils/linearAlg2D.h
modified src/utils/logoutput.h
modified src/utils/math.h
modified src/utils/optional.h
modified src/utils/orderOptimizer.h
modified src/utils/polygon.cpp
modified src/utils/polygon.h
modified src/utils/polygonUtils.cpp
modified src/utils/polygonUtils.h
modified src/utils/socket.cpp
modified src/utils/string.h
modified src/wallOverlap.cpp
modified src/wallOverlap.h
modified src/weaveDataStorage.h
added tests/GCodeExportTest.cpp
added tests/MergeInfillLinesTest.cpp
added tests/TimeEstimateCalculatorTest.cpp
added tests/arcus
added tests/arcus/ArcusCommunicationPrivateTest.cpp
added tests/arcus/ArcusCommunicationTest.cpp
added tests/arcus/MockCommunication.h
added tests/arcus/MockSocket.cpp
added tests/arcus/MockSocket.h
added tests/cube_vertices.txt
deleted tests/infill
deleted tests/infill/SpaceFillingTreeFillTest.cpp
deleted tests/infill/SpaceFillingTreeFillTest.h
added tests/integration
added tests/integration/SlicePhaseTest.cpp
added tests/integration/resources
added tests/integration/resources/cube.stl
added tests/integration/resources/cylinder1000.stl
modified tests/main.cpp
added tests/settings
added tests/settings/SettingsTest.cpp
added tests/test_global_settings.txt
added tests/utils/AABB3DTest.cpp
added tests/utils/AABBTest.cpp
modified tests/utils/IntPointTest.cpp
deleted tests/utils/IntPointTest.h
modified tests/utils/LinearAlg2DTest.cpp
deleted tests/utils/LinearAlg2DTest.h
added tests/utils/MinimumSpanningTreeTest.cpp
added tests/utils/PolygonConnectorTest.cpp
modified tests/utils/PolygonTest.cpp
deleted tests/utils/PolygonTest.h
modified tests/utils/PolygonUtilsTest.cpp
deleted tests/utils/PolygonUtilsTest.h
modified tests/utils/SparseGridTest.cpp
deleted tests/utils/SparseGridTest.h
modified tests/utils/StringTest.cpp
deleted tests/utils/StringTest.h
modified tests/utils/UnionFindTest.cpp
deleted tests/utils/UnionFindTest.h
Committed revision 125.
Committing with 1 patches applied and 1 patches unapplied.
Committing to: /home/janitor/tmp/tmpwogw9emr/cura-engine/
modified debian/changelog
missing debian/patches/0001-Remove-outdated-copy-of-command_line_settings.json.patch
deleted debian/patches/0001-Remove-outdated-copy-of-command_line_settings.json.patch
modified debian/patches/series
Committed revision 126.
Worker failed: An error (1) occurred refreshing quilt patches: None

Applying patch debian/patches/1000-fix-openmp-sharing-gcc9.patch
patching file src/layerPart.cpp
Hunk #1 FAILED at 46.
1 out of 1 hunk FAILED -- rejects in file src/layerPart.cpp
patching file src/support.cpp
Hunk #1 FAILED at 720.
Hunk #2 FAILED at 775.
Hunk #3 FAILED at 978.
3 out of 3 hunks FAILED -- rejects in file src/support.cpp
Patch debian/patches/1000-fix-openmp-sharing-gcc9.patch does not apply (enforce with -f)

Elapsed time: 0:04:04.822095

Full worker log