Run of fresh-snapshots for darktable

Try this locally (using silver-platter):

debian-svp new-upstream --snapshot darktable 
729
730
731
732
733
734
735
736
737
dpkg-source: error: cannot represent change to tools/regression_tests/src/web/assets/bootstrap/fonts/glyphicons-halflings-regular.woff: binary file contents changed
dpkg-source: error: add tools/regression_tests/src/web/assets/bootstrap/fonts/glyphicons-halflings-regular.woff in debian/source/include-binaries if you want to store the modified binary in the debian tarball
dpkg-source: error: cannot represent change to tools/regression_tests/src/web/assets/bootstrap/fonts/glyphicons-halflings-regular.woff2: binary file contents changed
dpkg-source: error: add tools/regression_tests/src/web/assets/bootstrap/fonts/glyphicons-halflings-regular.woff2 in debian/source/include-binaries if you want to store the modified binary in the debian tarball
dpkg-source: warning: file darktable-3.4.0/tools/regression_tests/src/web/assets/bootstrap/js/bootstrap.min.js has no final newline (either original or modified version)
dpkg-source: warning: file darktable-3.4.0/tools/regression_tests/src/web/assets/bootstrap/js/npm.js has no final newline (either original or modified version)
dpkg-source: error: unrepresentable changes to source
E: Failed to package source directory /tmp/tmp4zt0v0bc/build-area/darktable-3.4.0
brz: ERROR: The build failed.

Summary

Merged new upstream version: 3.5.0+git20201226.cbbef67 (was: 3.4.0).

Full worker log Full build log