Run of fresh-releases for dask.distributed

Try this locally (using silver-platter):

debian-svp new-upstream dask.distributed 
1
2
3
4
5
6
7
8
9
10
11
12
13
14
15
16
17
18
19
20
21
22
23
24
25
26
27
28
29
30
31
32
33
34
35
36
37
38
39
40
41
42
Processing: dask.distributed
/usr/lib/python3/dist-packages/dulwich/repo.py:415: UserWarning: ref refs/tags/debian/1.14.3+ds.1-1 points at non-present sha 64868d340731eec811b584d8013bf9373c751881
  UserWarning)
/usr/lib/python3/dist-packages/dulwich/repo.py:415: UserWarning: ref refs/tags/debian/1.18.0+ds.1-1 points at non-present sha 336649c84471a505a6cb09085818503adf478d2b
  UserWarning)
/usr/lib/python3/dist-packages/dulwich/repo.py:415: UserWarning: ref refs/tags/upstream/1.20.2+ds.1 points at non-present sha 41330c5b9e0bf71c747b693389ce925922fbfa5d
  UserWarning)
/usr/lib/python3/dist-packages/dulwich/repo.py:415: UserWarning: ref refs/tags/upstream/1.19.2+ds.1 points at non-present sha afe3996b546fad91cbfbbb8c52877a570745032e
  UserWarning)
/usr/lib/python3/dist-packages/dulwich/repo.py:415: UserWarning: ref refs/tags/debian/1.25.0+ds.1-1 points at non-present sha 78fafc753230492681719cd00e642837b8fdd2d6
  UserWarning)
/usr/lib/python3/dist-packages/dulwich/repo.py:415: UserWarning: ref refs/tags/debian/1.21.8+ds.1-1 points at non-present sha 9a0e020e01283c5072a232232a49f917d7e20a98
  UserWarning)
/usr/lib/python3/dist-packages/dulwich/repo.py:415: UserWarning: ref refs/tags/upstream/1.18.0+ds.1 points at non-present sha fff6aca5a20ac93049918a4e82a7802be3440b33
  UserWarning)
/usr/lib/python3/dist-packages/dulwich/repo.py:415: UserWarning: ref refs/tags/debian/1.20.2+ds.1-1 points at non-present sha 4caa2b0c196294a8127e5bf8483c21029aea9835
  UserWarning)
/usr/lib/python3/dist-packages/dulwich/repo.py:415: UserWarning: ref refs/tags/debian/1.20.2+ds.1-2 points at non-present sha ae6fe2c370c4750b6d30f1a3463f77ec34d163b4
  UserWarning)
debian/1.14.3+ds.1-1 does not point to a valid object
debian/1.18.0+ds.1-1 does not point to a valid object
upstream/1.20.2+ds.1 does not point to a valid object
upstream/1.19.2+ds.1 does not point to a valid object
debian/1.25.0+ds.1-1 does not point to a valid object
debian/1.21.8+ds.1-1 does not point to a valid object
upstream/1.18.0+ds.1 does not point to a valid object
debian/1.20.2+ds.1-1 does not point to a valid object
debian/1.20.2+ds.1-2 does not point to a valid object
1/158)   
Total 508 (delta 400), reused 452 (delta 348)

All changes applied successfully.
Worker failed: An error (1) occurred running quilt in the original tree: None

Applying patch debian/patches/override-worker-test.patch
patching file distributed/tests/test_worker.py
Hunk #1 FAILED at 210.
Hunk #2 FAILED at 236.
2 out of 2 hunks FAILED -- rejects in file distributed/tests/test_worker.py
Patch debian/patches/override-worker-test.patch does not apply (enforce with -f)

Elapsed time: 0:00:20.856124

Full worker log