Run of fresh-snapshots for dbus-python

Try this locally (using the lintian-brush package):

debcheckout dbus-python
cd dbus-python
new-upstream --snapshot
1020
1021
1022
1023
1024
1025
1026
1027
1028
1029
1030
1031
1032
1033
1034
		PYTHON=/usr/bin/python$x \
		--disable-documentation \
		--enable-installed-tests \
		--libdir=/usr/lib \
		; \
done
	cd build-3.9-dbg && ../configure --build=x86_64-linux-gnu --prefix=/usr --includedir=\${prefix}/include --mandir=\${prefix}/share/man --infodir=\${prefix}/share/info --sysconfdir=/etc --localstatedir=/var --disable-option-checking --disable-silent-rules --libdir=\${prefix}/lib/x86_64-linux-gnu --runstatedir=/run --disable-maintainer-mode --disable-dependency-tracking PYTHON=/usr/bin/python3.9-dbg --disable-documentation --enable-installed-tests --libdir=/usr/lib
Can't exec "../configure": No such file or directory at /usr/share/perl5/Debian/Debhelper/Dh_Lib.pm line 522.
dh_auto_configure: error: cd build-3.9-dbg && ../configure --build=x86_64-linux-gnu --prefix=/usr --includedir=\${prefix}/include --mandir=\${prefix}/share/man --infodir=\${prefix}/share/info --sysconfdir=/etc --localstatedir=/var --disable-option-checking --disable-silent-rules --libdir=\${prefix}/lib/x86_64-linux-gnu --runstatedir=/run --disable-maintainer-mode --disable-dependency-tracking PYTHON=/usr/bin/python3.9-dbg --disable-documentation --enable-installed-tests --libdir=/usr/lib failed to execute: No child processes
dh_auto_configure: error: cd build-3.9-dbg && ../configure --build=x86_64-linux-gnu --prefix=/usr --includedir=\${prefix}/include --mandir=\${prefix}/share/man --infodir=\${prefix}/share/info --sysconfdir=/etc --localstatedir=/var --disable-option-checking --disable-silent-rules --libdir=\${prefix}/lib/x86_64-linux-gnu --runstatedir=/run --disable-maintainer-mode --disable-dependency-tracking PYTHON=/usr/bin/python3.9-dbg --disable-documentation --enable-installed-tests --libdir=/usr/lib returned exit code 2
make[2]: *** [debian/rules:23: override_dh_auto_configure-arch] Error 2
make[2]: Leaving directory '/<<PKGBUILDDIR>>'
make[1]: *** [debian/rules:19: build] Error 2
make[1]: Leaving directory '/<<PKGBUILDDIR>>'
make: *** [debian/rules:19: binary] Error 2

Summary

Merged new upstream version: 1.2.16+git20201123.1.576cab6 (was: 1.2.16).

Full worker log Full build log Full dist log