Run of fresh-releases for django-pipeline

Try this locally (using silver-platter):

debian-svp new-upstream django-pipeline 
11
12
13
14
15
16
17
18
19
20
21
dpkg-source: info: using patch list from debian/patches/series
patching file tests/tests/test_compressor.py
Hunk #1 FAILED at 228.
1 out of 1 hunk FAILED
dpkg-source: info: the patch has fuzz which is not allowed, or is malformed
dpkg-source: info: if patch '0001-Remove-slimit-test.patch' is correctly applied by quilt, use 'quilt refresh' to update it
dpkg-source: error: LC_ALL=C patch -t -F 0 -N -p1 -u -V never -E -b -B .pc/0001-Remove-slimit-test.patch/ --reject-file=- < django-pipeline-2.0.6.orig.jh47bJ/debian/patches/0001-Remove-slimit-test.patch subprocess returned exit status 1
E: Failed to open build log /tmp/tmpxvsrmsmj/build-area//tmp/tmpxvsrmsmj/build-area/django-pipeline_2.0.6-1~jan+nur1.dsc_amd64-2021-03-28T10:23:22Z.build: No such file or directory
print() on closed filehandle $PLOG at /usr/share/perl5/Sbuild/Base.pm line 90.
E: unable to mktemp
brz: ERROR: The build failed.

Summary

Merged new upstream version: 2.0.6 (was: 1.6.14).

Full worker log Full build log