Run of fresh-releases for dwarfutils

Try this locally (using silver-platter):

debian-svp new-upstream dwarfutils 
13
14
15
16
17
18
19
20
21
22
dpkg-source: warning: ignoring deletion of file dwarfexample/getdebuglink.c, use --include-removal to override
dpkg-source: error: cannot represent change to dwarfexample/dummyexecutable: binary file contents changed
dpkg-source: error: add dwarfexample/dummyexecutable in debian/source/include-binaries if you want to store the modified binary in the debian tarball
dpkg-source: error: cannot represent change to dwarfexample/dummyexecutable.debug: binary file contents changed
dpkg-source: error: add dwarfexample/dummyexecutable.debug in debian/source/include-binaries if you want to store the modified binary in the debian tarball
dpkg-source: warning: executable mode 0755 of 'dwarfexample/dummyexecutable.debug' will not be represented in diff
dpkg-source: error: cannot represent change to libdwarf/libdwarf2.1.pdf: binary file contents changed
dpkg-source: error: add libdwarf/libdwarf2.1.pdf in debian/source/include-binaries if you want to store the modified binary in the debian tarball
E: Failed to package source directory /home/janitor/tmp/tmpqk6dxwmk/build-area/dwarfutils-20200825
brz: ERROR: The build failed.

Summary

Merged new upstream version: 20201020 (was: 20200825).

Full worker log Full build log