Run of fresh-snapshots for ergo

Try this locally (using the package):

debcheckout ergo
cd ergo
new-upstream --snapshot
568
569
570
571
572
573
574
575
576
577
578
579
580
581
582
dh_auto_install
rm -f /<<PKGBUILDDIR>>/debian/ergo/usr/bin/test
make[1]: Leaving directory '/<<PKGBUILDDIR>>'
   dh_install
dh_install: warning: Cannot find (any matches for) "usr/bin" (tried in ., debian/tmp)

dh_install: warning: ergo missing files: usr/bin
dh_install: warning: Cannot find (any matches for) "usr/share" (tried in ., debian/tmp)

dh_install: warning: ergo-data missing files: usr/share
dh_install: error: missing files, aborting
make: *** [debian/rules:12: binary] Error 25
dpkg-buildpackage: error: fakeroot debian/rules binary subprocess returned exit status 2
--------------------------------------------------------------------------------
Build finished at 2021-06-06T11:05:23Z

Summary

Merged new upstream version: 3.8+git20190719.1.c454f36 (was: 3.8).

Full worker log Full build log