Run of scrub-obsolete for erlang-cuttlefish

Try this locally (using the lintian-brush package):

debcheckout erlang-cuttlefish
cd erlang-cuttlefish
deb-scrub-obsolete
1519
1520
1521
1522
1523
1524
1525
1526
1527
1528
1529
1530
1531
1532
1533
DEBUG: Missing deps  : []
DEBUG: Plugins requested while processing /<<PKGBUILDDIR>>: []
DEBUG: Predirs: []
==> erlang-cuttlefish-2.0.11+dfsg (compile)
DEBUG: Matched required ERTS version: 11.1.6 -> .*
ERROR: OTP release 23 does not match required regex R16|17|18|19|20|21
ERROR: compile failed while processing /<<PKGBUILDDIR>>: rebar_abort
make[1]: *** [/usr/share/dh-rebar/make/dh-rebar.Makefile:126: rebar_compile] Error 1
dh_auto_build: error: make --no-print-directory -f /usr/share/dh-rebar/make/dh-rebar.Makefile build returned exit code 2
make: *** [debian/rules:7: build] Error 25
dpkg-buildpackage: error: debian/rules build subprocess returned exit status 2
--------------------------------------------------------------------------------
Build finished at 2021-01-21T12:43:57Z

Finished

Full worker log Full build log