Run of lintian-fixes for fwupd

Try this locally (using the lintian-brush package):

debcheckout fwupd
cd fwupd
lintian-brush
2178
2179
2180
2181
2182
2183
2184
2185
2186
2187
2188
2189
2190
2191
2192
2193
[3/380] /usr/bin/gcab --create --nopath data/tests/missing-hwid/hwid-1.2.3.cab ../data/tests/missing-hwid/firmware.bin ../data/tests/missing-hwid/firmware.metainfo.xml
[4/380] /usr/bin/gcab --create --nopath data/tests/missing-hwid/noreqs-1.2.3.cab ../data/tests/missing-hwid/firmware.bin ../data/tests/missing-hwid/firmware2.metainfo.xml
[5/380] /usr/bin/gcab --create --nopath data/installed-tests/fakedevice123.cab ../data/installed-tests/fakedevice123.bin ../data/installed-tests/fakedevice123.bin.asc ../data/installed-tests/fakedevice123.metainfo.xml
[6/380] /usr/bin/gcab --create --nopath data/installed-tests/fakedevice124.cab ../data/installed-tests/fakedevice124.bin ../data/installed-tests/fakedevice124.bin.asc ../data/installed-tests/fakedevice124.metainfo.xml
[7/380] ccache cc -Ilibfwupd/ec37581@@fwupd@sha -Ilibfwupd -I../libfwupd -Ilibfwupd/.. -I../libfwupd/.. -I/usr/include/gio-unix-2.0 -I/usr/include/libmount -I/usr/include/blkid -I/usr/include/glib-2.0 -I/usr/lib/x86_64-linux-gnu/glib-2.0/include -I/usr/include/libsoup-2.4 -I/usr/include/libxml2 -I/usr/include/json-glib-1.0 -fdiagnostics-color=always -pipe -D_FILE_OFFSET_BITS=64 -std=c99 -D_DEFAULT_SOURCE -DFWUPD_DISABLE_DEPRECATED -D_BSD_SOURCE -D_XOPEN_SOURCE=700 -g -O2 -fdebug-prefix-map=/<<PKGBUILDDIR>>=. -fstack-protector-strong -Wformat -Werror=format-security -Wdate-time -D_FORTIFY_SOURCE=2 -fPIC -pthread '-DG_LOG_DOMAIN="Fwupd"' '-DLOCALSTATEDIR="/var"' -MD -MQ 'libfwupd/ec37581@@fwupd@sha/fwupd-client.c.o' -MF 'libfwupd/ec37581@@fwupd@sha/fwupd-client.c.o.d' -o 'libfwupd/ec37581@@fwupd@sha/fwupd-client.c.o' -c ../libfwupd/fwupd-client.c
FAILED: libfwupd/ec37581@@fwupd@sha/fwupd-client.c.o 
ccache cc -Ilibfwupd/ec37581@@fwupd@sha -Ilibfwupd -I../libfwupd -Ilibfwupd/.. -I../libfwupd/.. -I/usr/include/gio-unix-2.0 -I/usr/include/libmount -I/usr/include/blkid -I/usr/include/glib-2.0 -I/usr/lib/x86_64-linux-gnu/glib-2.0/include -I/usr/include/libsoup-2.4 -I/usr/include/libxml2 -I/usr/include/json-glib-1.0 -fdiagnostics-color=always -pipe -D_FILE_OFFSET_BITS=64 -std=c99 -D_DEFAULT_SOURCE -DFWUPD_DISABLE_DEPRECATED -D_BSD_SOURCE -D_XOPEN_SOURCE=700 -g -O2 -fdebug-prefix-map=/<<PKGBUILDDIR>>=. -fstack-protector-strong -Wformat -Werror=format-security -Wdate-time -D_FORTIFY_SOURCE=2 -fPIC -pthread '-DG_LOG_DOMAIN="Fwupd"' '-DLOCALSTATEDIR="/var"' -MD -MQ 'libfwupd/ec37581@@fwupd@sha/fwupd-client.c.o' -MF 'libfwupd/ec37581@@fwupd@sha/fwupd-client.c.o.d' -o 'libfwupd/ec37581@@fwupd@sha/fwupd-client.c.o' -c ../libfwupd/fwupd-client.c
ccache: error: Failed to create directory /sbuild-nonexistent/.ccache/tmp: Permission denied
[8/380] /usr/bin/certtool --generate-privkey --outfile data/tests/test-privkey.pem
Generating a 3072 bit RSA private key...
[9/380] /usr/bin/meson --internal msgfmthelper ../data/remotes.d/lvfs.metainfo.xml data/remotes.d/org.freedesktop.fwupd.remotes.lvfs.metainfo.xml xml /<<PKGBUILDDIR>>/po --datadirs=/<<PKGBUILDDIR>>/po
[10/380] /usr/bin/meson --internal msgfmthelper ../data/remotes.d/lvfs-testing.metainfo.xml data/remotes.d/org.freedesktop.fwupd.remotes.lvfs-testing.metainfo.xml xml /<<PKGBUILDDIR>>/po --datadirs=/<<PKGBUILDDIR>>/po
ninja: build stopped: subcommand failed.
dh_auto_build: cd obj-x86_64-linux-gnu && LC_ALL=C.UTF-8 ninja -j4 -v returned exit code 1
make: *** [debian/rules:31: build] Error 255
dpkg-buildpackage: error: debian/rules build subprocess returned exit status 2

Summary

Full build log Full worker log