Run of fresh-snapshots for gist

Try this locally (using silver-platter):

debian-svp new-upstream --snapshot gist 
1
2
3
4
5
6
7
8
9
10
11
12
13
14
15
16
17
18
19
20
21
22
23
24
25
26
27
28
29
30
31
32
33
34
35
36
37
38
39
40
41
42
43
44
45
46
47
48
49
50
51
52
53
54
55
56
57
58
59
60
61
62
63
64
65
66
67
68
69
70
71
72
73
74
Processing: gist
Total 0 (delta 0), reused 0 (delta 0)

Using upstream branch https://github.com/defunkt/gist (guessed)
Total 1966 (delta 0), reused 0 (delta 0), pack-reused 1966

Using version string 5.0.0+git20190622.0b7f435.
No upstream upstream-revision format specified, trying git:0b7f435
No upstream upstream-revision format specified, trying git:0b7f435
Exporting upstream branch revision b'git-v1:0b7f43552c9497088101b7c10ca45b907a2d13a5' to create the tarball
Total 1966 (delta 0), reused 0 (delta 0), pack-reused 1966
v0.7.5 does not point to a valid object
/usr/lib/python3/dist-packages/dulwich/repo.py:393: UserWarning: ref refs/tags/v2.0.2 points at non-present sha 0db079ae923ecc6272bea53a150ad32aa4d2905b
  UserWarning)
/usr/lib/python3/dist-packages/dulwich/repo.py:393: UserWarning: ref refs/tags/v2.0.0 points at non-present sha 65cc91911258daff89da17aecdcdddb9200eef29
  UserWarning)
/usr/lib/python3/dist-packages/dulwich/repo.py:393: UserWarning: ref refs/tags/v2.0.3 points at non-present sha bcee9f87c7826e2911b7d00ef956ff9c40cb0844
  UserWarning)
/usr/lib/python3/dist-packages/dulwich/repo.py:393: UserWarning: ref refs/tags/v1.4.0 points at non-present sha 2f791aa15324ef5060759e350030ef3c95079bcf
  UserWarning)
/usr/lib/python3/dist-packages/dulwich/repo.py:393: UserWarning: ref refs/tags/v1.4.1 points at non-present sha 0aeab4a3789cfb8f8100bd79fa61618c8a09bb8a
  UserWarning)
/usr/lib/python3/dist-packages/dulwich/repo.py:393: UserWarning: ref refs/tags/v1.3.0 points at non-present sha d110f34393bcffac239f1a5283ef0483a4811cdb
  UserWarning)
Not storing pristine-tar metadata, since there is no pristine-tar branch.
/usr/lib/python3/dist-packages/dulwich/repo.py:393: UserWarning: ref refs/tags/v2.0.2 points at non-present sha 0db079ae923ecc6272bea53a150ad32aa4d2905b
  UserWarning)
/usr/lib/python3/dist-packages/dulwich/repo.py:393: UserWarning: ref refs/tags/v2.0.0 points at non-present sha 65cc91911258daff89da17aecdcdddb9200eef29
  UserWarning)
/usr/lib/python3/dist-packages/dulwich/repo.py:393: UserWarning: ref refs/tags/v2.0.3 points at non-present sha bcee9f87c7826e2911b7d00ef956ff9c40cb0844
  UserWarning)
/usr/lib/python3/dist-packages/dulwich/repo.py:393: UserWarning: ref refs/tags/v1.4.0 points at non-present sha 2f791aa15324ef5060759e350030ef3c95079bcf
  UserWarning)
/usr/lib/python3/dist-packages/dulwich/repo.py:393: UserWarning: ref refs/tags/v1.4.1 points at non-present sha 0aeab4a3789cfb8f8100bd79fa61618c8a09bb8a
  UserWarning)
/usr/lib/python3/dist-packages/dulwich/repo.py:393: UserWarning: ref refs/tags/v1.3.0 points at non-present sha d110f34393bcffac239f1a5283ef0483a4811cdb
  UserWarning)
v2.0.2 does not point to a valid object
v2.0.0 does not point to a valid object
v2.0.3 does not point to a valid object
v1.4.0 does not point to a valid object
v1.4.1 does not point to a valid object
v1.3.0 does not point to a valid object
All changes applied successfully.
v2.0.2 does not point to a valid object
v2.0.0 does not point to a valid object
v2.0.3 does not point to a valid object
v1.4.0 does not point to a valid object
v1.4.1 does not point to a valid object
v1.3.0 does not point to a valid object
Committing to: /home/janitor/tmp/tmpvi1u54dd/gist/
modified README.md
modified bin/gist
modified debian/changelog
modified lib/gist.rb
modified spec/rawify_spec.rb
modified spec/shorten_spec.rb
Committed revision 72.
Worker failed: An error (1) occurred refreshing quilt patches: None

Applying patch debian/patches/rename
patching file README.md
Hunk #2 succeeded at 30 (offset 5 lines).
Hunk #3 FAILED at 83.
Hunk #4 FAILED at 96.
Hunk #5 FAILED at 118.
Hunk #6 succeeded at 134 (offset 1 line).
3 out of 8 hunks FAILED -- rejects in file README.md
patching file Rakefile
patching file gist.gemspec
patching file build/gist.1
Patch debian/patches/rename does not apply (enforce with -f)

Elapsed time: 0:00:38.318197

Full worker log