Run of fresh-releases for golang-github-azure-go-ntlmssp

564
565
566
567
568
569
570
571
572
573
574
575
576
577
578
   dh_auto_build -O--buildsystem=golang
	cd obj-x86_64-linux-gnu && go install -trimpath -v -p 32 github.com/Azure/go-ntlmssp
golang.org/x/crypto/md4
github.com/Azure/go-ntlmssp
   dh_auto_test -O--buildsystem=golang
	cd obj-x86_64-linux-gnu && go test -vet=off -v -p 32 github.com/Azure/go-ntlmssp
# github.com/Azure/go-ntlmssp [github.com/Azure/go-ntlmssp.test]
src/github.com/Azure/go-ntlmssp/nlmp_test.go:52:35: error: function result count mismatch
   52 |                 tuser, tdomain := GetDomain(table.u)
      |                                   ^
FAIL	github.com/Azure/go-ntlmssp [build failed]
FAIL
dh_auto_test: error: cd obj-x86_64-linux-gnu && go test -vet=off -v -p 32 github.com/Azure/go-ntlmssp returned exit code 2
make: *** [debian/rules:4: binary] Error 25
dpkg-buildpackage: error: debian/rules binary subprocess returned exit status 2

Publish Blockers

  • ☒ run was not successful
  • ☑ package has not been removed from the archive
  • ☑ command has not changed
  • ☒ not yet reviewed, but review needed
  • ☑ 0 publish attempts so far.not currently attempting to back off
  • ☒ merge proposals for the package maintainer are currently being rate-limited (open: 1257, max open: 300)
  • ☒ change set 161f2c97-dfc2-4a4d-95fa-0f2c94f52654 is working

Full worker log Full build log