Run of fresh-releases for golang-github-getlantern-errors

Try this locally (using silver-platter):

debian-svp new-upstream golang-github-getlantern-errors 
661
662
663
664
665
666
667
668
669
670
671
672
673
674
675
=== RUN   TestHiddenWithCause
--- PASS: TestHiddenWithCause (0.00s)
=== RUN   TestFill
--- PASS: TestFill (0.00s)
=== RUN   TestUnwrapping
--- PASS: TestUnwrapping (0.00s)
FAIL
FAIL	github.com/getlantern/errors	0.316s
FAIL
dh_auto_test: error: cd obj-x86_64-linux-gnu && go test -vet=off -v -p 32 github.com/getlantern/errors returned exit code 1
make: *** [debian/rules:4: build] Error 25
dpkg-buildpackage: error: debian/rules build subprocess returned exit status 2
--------------------------------------------------------------------------------
Build finished at 2021-04-09T21:35:08Z

Summary

Merged new upstream version: 1.0.1 (was: 0.0~git20190325.abdb3e3).

Full worker log Full build log