Run of fresh-snapshots for golang-github-go-kit-kit

Try this locally (using the lintian-brush package):

debcheckout golang-github-go-kit-kit
cd golang-github-go-kit-kit
new-upstream --snapshot --refresh-patches
1170
1171
1172
1173
1174
1175
1176
1177
1178
1179
1180
1181
1182
1183
1184
	/<<PKGBUILDDIR>>/obj-x86_64-linux-gnu/src/github.com/openzipkin/zipkin-go/model (from $GOPATH)
src/github.com/go-kit/kit/tracing/zipkin/grpc.go:9:2: cannot find package "github.com/openzipkin/zipkin-go/propagation/b3" in any of:
	/usr/src/github.com/openzipkin/zipkin-go/propagation/b3 (from $GOROOT)
	/<<PKGBUILDDIR>>/obj-x86_64-linux-gnu/src/github.com/openzipkin/zipkin-go/propagation/b3 (from $GOPATH)
src/github.com/go-kit/kit/transport/amqp/encode_decode.go:6:2: cannot find package "github.com/streadway/amqp" in any of:
	/usr/src/github.com/streadway/amqp (from $GOROOT)
	/<<PKGBUILDDIR>>/obj-x86_64-linux-gnu/src/github.com/streadway/amqp (from $GOPATH)
src/github.com/go-kit/kit/transport/nats/encode_decode.go:6:2: cannot find package "github.com/nats-io/nats.go" in any of:
	/usr/src/github.com/nats-io/nats.go (from $GOROOT)
	/<<PKGBUILDDIR>>/obj-x86_64-linux-gnu/src/github.com/nats-io/nats.go (from $GOPATH)
dh_auto_build: error: cd obj-x86_64-linux-gnu && go install -trimpath -v -p 1 github.com/go-kit/kit/auth/basic github.com/go-kit/kit/auth/casbin github.com/go-kit/kit/auth/jwt github.com/go-kit/kit/cmd/kitgen github.com/go-kit/kit/cmd/kitgen/templates github.com/go-kit/kit/endpoint github.com/go-kit/kit/log github.com/go-kit/kit/log/deprecated_levels github.com/go-kit/kit/log/level github.com/go-kit/kit/log/logrus github.com/go-kit/kit/log/syslog github.com/go-kit/kit/log/term github.com/go-kit/kit/log/zap github.com/go-kit/kit/tracing github.com/go-kit/kit/tracing/opencensus github.com/go-kit/kit/tracing/opentracing github.com/go-kit/kit/tracing/zipkin github.com/go-kit/kit/transport github.com/go-kit/kit/transport/amqp github.com/go-kit/kit/transport/awslambda github.com/go-kit/kit/transport/grpc github.com/go-kit/kit/transport/http github.com/go-kit/kit/transport/http/jsonrpc github.com/go-kit/kit/transport/http/proto github.com/go-kit/kit/transport/httprp github.com/go-kit/kit/transport/nats github.com/go-kit/kit/util/conn returned exit code 1
make: *** [debian/rules:16: build] Error 25
dpkg-buildpackage: error: debian/rules build subprocess returned exit status 2
--------------------------------------------------------------------------------
Build finished at 2021-06-11T18:10:01Z

Summary

Merged new upstream version: 0.10.0+git20210605.1.73c7f45 (was: 0.6.0).

Full worker log Full build log Full dist log