Run of fresh-snapshots for golang-github-hashicorp-go-plugin

Try this locally (using silver-platter):

debian-svp new-upstream --snapshot golang-github-hashicorp-go-plugin 
856
857
858
859
860
861
862
863
864
865
866
867
868
869
870
dh_auto_test
	cd obj-x86_64-linux-gnu && go test -vet=off -v -p 32 github.com/hashicorp/go-plugin github.com/hashicorp/go-plugin/internal/plugin
# github.com/hashicorp/go-plugin
package github.com/hashicorp/go-plugin (test)
	imports github.com/jhump/protoreflect/grpcreflect: cannot find package "github.com/jhump/protoreflect/grpcreflect" in any of:
	/usr/src/github.com/jhump/protoreflect/grpcreflect (from $GOROOT)
	/<<PKGBUILDDIR>>/obj-x86_64-linux-gnu/src/github.com/jhump/protoreflect/grpcreflect (from $GOPATH)
FAIL	github.com/hashicorp/go-plugin [setup failed]
?   	github.com/hashicorp/go-plugin/internal/plugin	[no test files]
FAIL
dh_auto_test: error: cd obj-x86_64-linux-gnu && go test -vet=off -v -p 32 github.com/hashicorp/go-plugin github.com/hashicorp/go-plugin/internal/plugin returned exit code 1
make[1]: *** [debian/rules:10: override_dh_auto_test] Error 25
make[1]: Leaving directory '/<<PKGBUILDDIR>>'
make: *** [debian/rules:7: build] Error 2
dpkg-buildpackage: error: debian/rules build subprocess returned exit status 2

Summary

Merged new upstream version: 1.4.1 (was: 1.0.1).

Full worker log Full build log