Run of fresh-releases for golang-github-hashicorp-hcl

Try this locally (using silver-platter):

debian-svp new-upstream golang-github-hashicorp-hcl 
562
563
564
565
566
567
568
569
570
571
572
573
574
575
576
	/<<PKGBUILDDIR>>/obj-x86_64-linux-gnu/src/github.com/zclconf/go-cty/cty/gocty (from $GOPATH)
src/github.com/hashicorp/hcl/cmd/hcldec/main.go:17:2: cannot find package "github.com/zclconf/go-cty/cty/json" in any of:
	/usr/src/github.com/zclconf/go-cty/cty/json (from $GOROOT)
	/<<PKGBUILDDIR>>/obj-x86_64-linux-gnu/src/github.com/zclconf/go-cty/cty/json (from $GOPATH)
src/github.com/hashicorp/hcl/cmd/hcldec/main.go:18:2: cannot find package "golang.org/x/crypto/ssh/terminal" in any of:
	/usr/src/golang.org/x/crypto/ssh/terminal (from $GOROOT)
	/<<PKGBUILDDIR>>/obj-x86_64-linux-gnu/src/golang.org/x/crypto/ssh/terminal (from $GOPATH)
src/github.com/hashicorp/hcl/cmd/hclspecsuite/runner.go:14:2: cannot find package "github.com/zclconf/go-cty-debug/ctydebug" in any of:
	/usr/src/github.com/zclconf/go-cty-debug/ctydebug (from $GOROOT)
	/<<PKGBUILDDIR>>/obj-x86_64-linux-gnu/src/github.com/zclconf/go-cty-debug/ctydebug (from $GOPATH)
dh_auto_build: error: cd obj-x86_64-linux-gnu && go install -trimpath -v -p 32 github.com/hashicorp/hcl github.com/hashicorp/hcl/cmd/hcldec github.com/hashicorp/hcl/cmd/hclfmt github.com/hashicorp/hcl/cmd/hclspecsuite github.com/hashicorp/hcl/ext/customdecode github.com/hashicorp/hcl/ext/dynblock github.com/hashicorp/hcl/ext/transform github.com/hashicorp/hcl/ext/tryfunc github.com/hashicorp/hcl/ext/typeexpr github.com/hashicorp/hcl/ext/userfunc github.com/hashicorp/hcl/gohcl github.com/hashicorp/hcl/hcldec github.com/hashicorp/hcl/hcled github.com/hashicorp/hcl/hclparse github.com/hashicorp/hcl/hclsimple github.com/hashicorp/hcl/hclsyntax github.com/hashicorp/hcl/hclsyntax/fuzz/config github.com/hashicorp/hcl/hclsyntax/fuzz/expr github.com/hashicorp/hcl/hclsyntax/fuzz/template github.com/hashicorp/hcl/hclsyntax/fuzz/traversal github.com/hashicorp/hcl/hcltest github.com/hashicorp/hcl/hclwrite github.com/hashicorp/hcl/hclwrite/fuzz/config github.com/hashicorp/hcl/integrationtest github.com/hashicorp/hcl/json github.com/hashicorp/hcl/json/fuzz/config returned exit code 1
make: *** [debian/rules:15: build] Error 25
dpkg-buildpackage: error: debian/rules build subprocess returned exit status 2
--------------------------------------------------------------------------------
Build finished at 2021-03-28T11:03:55Z

Summary

Merged new upstream version: 2.9.1 (was: 1.0.0).

Full worker log Full build log