Run of fresh-releases for golang-github-hashicorp-memberlist

Try this locally (using silver-platter):

debian-svp new-upstream golang-github-hashicorp-memberlist 
1
2
3
4
5
6
7
8
9
10
11
12
13
14
15
16
17
18
19
20
21
22
23
24
25
26
27
28
29
30
31
32
33
34
35
36
37
38
39
40
41
42
43
44
45
46
47
48
49
50
51
52
53
54
55
56
57
58
59
60
61
62
63
64
65
66
67
68
69
70
71
72
73
Processing: golang-github-hashicorp-memberlist
5/258)   
Total 269 (delta 0), reused 269 (delta 0)
Using upstream branch https://github.com/hashicorp/memberlist (guessed)
Total 2182 (delta 5), reused 13 (delta 5), pack-reused 2165
Using version string 0.1.4.
No upstream upstream-revision format specified, trying tag:0.1.4
No upstream upstream-revision format specified, trying tag:golang-github-hashicorp-memberlist-0.1.4
No upstream upstream-revision format specified, trying tag:v0.1.4
Using uscan to look for the upstream tarball.
  41% (5/12)   
Total 2182 (delta 5), reused 13 (delta 5), pack-reused 2165
/usr/lib/python3/dist-packages/dulwich/repo.py:393: UserWarning: ref refs/tags/v0.1.0 points at non-present sha e826af2424dd8fda883416c931061501a0182682
  UserWarning)
Not storing pristine-tar metadata, since there is no pristine-tar branch.
/usr/lib/python3/dist-packages/dulwich/repo.py:393: UserWarning: ref refs/tags/v0.1.0 points at non-present sha e826af2424dd8fda883416c931061501a0182682
  UserWarning)
v0.1.0 does not point to a valid object
All changes applied successfully.
v0.1.0 does not point to a valid object
Committing to: /home/janitor/tmp/tmpcdvcdhfn/golang-github-hashicorp-memberlist/
added .travis.yml
modified Makefile
modified README.md
modified alive_delegate.go
modified broadcast.go
modified config.go
modified debian/changelog
added go.mod
added go.sum
modified integ_test.go
modified memberlist.go
modified memberlist_test.go
modified net.go
modified net_test.go
modified net_transport.go
modified queue.go
modified queue_test.go
modified state.go
modified state_test.go
modified transport_test.go
modified util.go
added z_test.go
Committed revision 33.
Worker failed: An error (1) occurred refreshing quilt patches: None

Applying patch debian/patches/01-Vendor-sean--seed.patch
patching file vendor/github.com/sean-/seed/LICENSE
patching file vendor/github.com/sean-/seed/README.md
patching file vendor/github.com/sean-/seed/init.go
patching file vendor/github.com/sean-/seed/init_test.go
Refreshed patch debian/patches/01-Vendor-sean--seed.patch

Applying patch debian/patches/02-Fix-failing-tests.patch
patching file memberlist_test.go
Hunk #1 FAILED at 423.
Hunk #2 FAILED at 736.
Hunk #3 FAILED at 930.
Hunk #4 FAILED at 1104.
Hunk #5 succeeded at 1352 with fuzz 2 (offset 52 lines).
4 out of 5 hunks FAILED -- rejects in file memberlist_test.go
patching file state_test.go
Hunk #1 succeeded at 732 (offset 131 lines).
Hunk #2 FAILED at 1771.
1 out of 2 hunks FAILED -- rejects in file state_test.go
patching file transport_test.go
Hunk #1 FAILED at 1.
Hunk #2 FAILED at 115.
2 out of 2 hunks FAILED -- rejects in file transport_test.go
patching file suspicion_test.go
Patch debian/patches/02-Fix-failing-tests.patch does not apply (enforce with -f)

Elapsed time: 0:00:32.908070

Full worker log