Run of fresh-releases for golang-github-hashicorp-terraform-plugin-test

Try this locally (using silver-platter):

debian-svp new-upstream golang-github-hashicorp-terraform-plugin-test 
875
876
877
878
879
880
881
882
883
884
885
886
887
888
889
   dh_autoreconf -O--buildsystem=golang
   dh_auto_configure -O--buildsystem=golang
   dh_auto_build -O--buildsystem=golang
	cd obj-x86_64-linux-gnu && go install -trimpath -v -p 32 github.com/hashicorp/terraform-plugin-test
src/github.com/hashicorp/terraform-plugin-test/working_dir.go:12:2: cannot find package "github.com/hashicorp/terraform-exec/tfexec" in any of:
	/usr/src/github.com/hashicorp/terraform-exec/tfexec (from $GOROOT)
	/<<PKGBUILDDIR>>/obj-x86_64-linux-gnu/src/github.com/hashicorp/terraform-exec/tfexec (from $GOPATH)
src/github.com/hashicorp/terraform-plugin-test/config.go:9:2: cannot find package "github.com/hashicorp/terraform-exec/tfinstall" in any of:
	/usr/src/github.com/hashicorp/terraform-exec/tfinstall (from $GOROOT)
	/<<PKGBUILDDIR>>/obj-x86_64-linux-gnu/src/github.com/hashicorp/terraform-exec/tfinstall (from $GOPATH)
dh_auto_build: error: cd obj-x86_64-linux-gnu && go install -trimpath -v -p 32 github.com/hashicorp/terraform-plugin-test returned exit code 1
make: *** [debian/rules:4: build] Error 25
dpkg-buildpackage: error: debian/rules build subprocess returned exit status 2
--------------------------------------------------------------------------------
Build finished at 2021-03-29T05:45:30Z

Summary

Merged new upstream version: 2.1.3 (was: 1.3.0+git20200503.328f99a).

Full worker log Full build log