Run of fresh-releases for golang-github-influxdata-go-syslog

Try this locally (using silver-platter):

debian-svp new-upstream golang-github-influxdata-go-syslog 
6358
6359
6360
6361
6362
6363
6364
6365
6366
6367
6368
6369
6370
6371
6372
--- PASS: Example_besteffort (0.00s)
=== RUN   Example_builder
--- PASS: Example_builder (0.01s)
PASS
ok  	github.com/influxdata/go-syslog/rfc5424	2.182s
?   	github.com/influxdata/go-syslog/testing	[no test files]
FAIL
dh_auto_test: error: cd obj-x86_64-linux-gnu && go test -vet=off -v -p 4 github.com/influxdata/go-syslog github.com/influxdata/go-syslog/common github.com/influxdata/go-syslog/nontransparent github.com/influxdata/go-syslog/octetcounting github.com/influxdata/go-syslog/rfc3164 github.com/influxdata/go-syslog/rfc5424 github.com/influxdata/go-syslog/testing returned exit code 1
make: *** [debian/rules:4: binary] Error 25
dpkg-buildpackage: error: debian/rules binary subprocess returned exit status 2
--------------------------------------------------------------------------------
Build finished at 2021-03-29T05:07:20Z

Finished
--------

Summary

Merged new upstream version: 3.0.0 (was: 2.0.1).

Full worker log Full build log