Run of fresh-releases for golang-github-json-iterator-go

Try this locally (using the package):

debcheckout golang-github-json-iterator-go
cd golang-github-json-iterator-go
new-upstream --refresh-patches
2721
2722
2723
2724
2725
2726
2727
2728
2729
2730
2731
2732
2733
2734
2735
	../../../src/libgo/go/testing/testing.go:1127
github.x2ecom..z2fjson..z2diterator..z2fgo..z2fvalue_tests.Test_marshal
	/<<PKGBUILDDIR>>/obj-x86_64-linux-gnu/src/github.com/json-iterator/go/value_tests/value_test.go:71
testing.tRunner
	../../../src/libgo/go/testing/testing.go:1075
created by testing.T.Run
	../../../src/libgo/go/testing/testing.go:1126 +0x478
FAIL	github.com/json-iterator/go/value_tests	0.254s
FAIL
dh_auto_test: error: cd obj-x86_64-linux-gnu && go test -vet=off -v -p 1 github.com/json-iterator/go github.com/json-iterator/go/any_tests github.com/json-iterator/go/api_tests github.com/json-iterator/go/benchmarks github.com/json-iterator/go/extension_tests github.com/json-iterator/go/extra github.com/json-iterator/go/misc_tests github.com/json-iterator/go/skip_tests github.com/json-iterator/go/type_tests github.com/json-iterator/go/value_tests returned exit code 1
make: *** [debian/rules:4: binary] Error 25
dpkg-buildpackage: error: debian/rules binary subprocess returned exit status 2
--------------------------------------------------------------------------------
Build finished at 2021-05-29T00:21:30Z

Summary

Merged new upstream version: 1.1.11 (was: 1.1.10).

Full worker log Full build log