Run of fresh-snapshots for golang-github-klauspost-reedsolomon

Try this locally (using silver-platter):

debian-svp new-upstream --snapshot golang-github-klauspost-reedsolomon 
517
518
519
520
521
522
523
524
525
526
527
528
529
530
531
 debian/rules binary
dh binary --buildsystem=golang --with=golang
   dh_update_autotools_config -O--buildsystem=golang
   dh_autoreconf -O--buildsystem=golang
   dh_auto_configure -O--buildsystem=golang
   dh_auto_build -O--buildsystem=golang
	cd obj-x86_64-linux-gnu && go install -trimpath -v -p 32 github.com/klauspost/reedsolomon
src/github.com/klauspost/reedsolomon/options.go:6:2: cannot find package "github.com/klauspost/cpuid/v2" in any of:
	/usr/src/github.com/klauspost/cpuid/v2 (from $GOROOT)
	/<<PKGBUILDDIR>>/obj-x86_64-linux-gnu/src/github.com/klauspost/cpuid/v2 (from $GOPATH)
dh_auto_build: error: cd obj-x86_64-linux-gnu && go install -trimpath -v -p 32 github.com/klauspost/reedsolomon returned exit code 1
make: *** [debian/rules:4: binary] Error 25
dpkg-buildpackage: error: debian/rules binary subprocess returned exit status 2
--------------------------------------------------------------------------------
Build finished at 2021-03-29T18:07:05Z

Summary

Merged new upstream version: 1.9.12+git20210326.60e17e6 (was: 1.9.9).

Full worker log Full build log Full dist log