Run of fresh-releases for golang-github-labstack-echo.v3

Try this locally (using silver-platter):

debian-svp new-upstream golang-github-labstack-echo.v3 
1
2
3
4
5
6
7
8
9
10
11
12
13
14
15
16
17
18
19
20
21
22
23
24
25
26
27
28
29
30
31
32
33
34
35
36
37
38
39
40
41
42
43
44
45
46
47
48
49
50
51
52
53
54
55
56
57
58
59
60
61
62
63
64
65
66
67
68
69
70
71
72
73
74
75
76
77
78
79
80
81
82
83
84
85
86
87
88
89
90
91
Processing: golang-github-labstack-echo.v3
git: refs/tags/debian/3.2.3-1 does not point to a valid object!
git: refs/tags/debian/3.2.6-1 does not point to a valid object!
git: refs/tags/debian/3.3.5-1 does not point to a valid object!
git: refs/tags/v1.1.0 does not point to a valid object!
Total 9557 (delta 19), reused 9538 (delta 0)

Using upstream branch https://github.com/labstack/echo.v3 (guessed)
Upstream branch https://github.com/labstack/echo.v3 inaccessible; ignoring. Invalid http response for https://github.com/labstack/echo.v3/info/refs?service=git-upload-pack: Unable to handle http code 401: Authorization Required
Using version string 4.1.6.
Using uscan to look for the upstream tarball.
Not storing pristine-tar metadata, since there is no pristine-tar branch.
All changes applied successfully.
Committing to: /home/janitor/tmp/tmpzmr_2eu4/golang-github-labstack-echo.v3/
added .github/stale.yml
modified .travis.yml
deleted Gopkg.lock
deleted Gopkg.toml
modified Makefile
modified README.md
modified bind.go
modified bind_test.go
modified context.go
modified context_test.go
modified debian/changelog
modified echo.go
modified echo_test.go
added go.mod
added go.sum
modified group.go
modified group_test.go
modified log.go
modified middleware/basic_auth.go
modified middleware/basic_auth_test.go
modified middleware/body_dump.go
modified middleware/body_dump_test.go
modified middleware/body_limit.go
modified middleware/body_limit_test.go
modified middleware/compress.go
modified middleware/compress_test.go
modified middleware/cors.go
modified middleware/cors_test.go
modified middleware/csrf.go
modified middleware/csrf_test.go
modified middleware/jwt.go
modified middleware/jwt_test.go
modified middleware/key_auth.go
modified middleware/key_auth_test.go
modified middleware/logger.go
modified middleware/logger_test.go
modified middleware/method_override.go
modified middleware/method_override_test.go
modified middleware/middleware.go
modified middleware/proxy.go
added middleware/proxy_1_11.go
added middleware/proxy_1_11_n.go
added middleware/proxy_1_11_test.go
modified middleware/proxy_test.go
modified middleware/recover.go
modified middleware/recover_test.go
modified middleware/redirect.go
modified middleware/redirect_test.go
modified middleware/request_id.go
modified middleware/request_id_test.go
modified middleware/rewrite.go
modified middleware/rewrite_test.go
modified middleware/secure.go
modified middleware/secure_test.go
modified middleware/slash.go
modified middleware/slash_test.go
modified middleware/static.go
modified middleware/static_test.go
added middleware/util.go
added middleware/util_test.go
modified response.go
modified response_test.go
modified router.go
modified router_test.go
Committed revision 964.
Worker failed: An error (1) occurred refreshing quilt patches: None

Applying patch debian/patches/change-path-of-jwt-go.patch
patching file middleware/jwt.go
Hunk #1 FAILED at 6.
1 out of 1 hunk FAILED -- rejects in file middleware/jwt.go
patching file middleware/jwt_test.go
Hunk #1 FAILED at 5.
1 out of 1 hunk FAILED -- rejects in file middleware/jwt_test.go
Patch debian/patches/change-path-of-jwt-go.patch does not apply (enforce with -f)

Elapsed time: 0:00:33.827103

Full worker log