Run of fresh-releases for golang-github-mattn-go-sqlite3

Try this locally (using silver-platter):

debian-svp new-upstream golang-github-mattn-go-sqlite3 
546
547
548
549
550
551
552
553
554
555
556
557
558
559
560
   dh_autoreconf -O--buildsystem=golang
   dh_auto_configure -O--buildsystem=golang
   dh_auto_build -O--buildsystem=golang
	cd obj-x86_64-linux-gnu && go install -gcflags=all=\"-trimpath=/<<PKGBUILDDIR>>/obj-x86_64-linux-gnu/src\" -asmflags=all=\"-trimpath=/<<PKGBUILDDIR>>/obj-x86_64-linux-gnu/src\" -v -p 4 github.com/mattn/go-sqlite3 github.com/mattn/go-sqlite3/upgrade
github.com/mattn/go-sqlite3/upgrade
github.com/mattn/go-sqlite3
# github.com/mattn/go-sqlite3
src/github.com/mattn/go-sqlite3/backup.go:10:10: fatal error: sqlite3-binding.h: No such file or directory
   10 | #include <sqlite3-binding.h>
      |          ^~~~~~~~~~~~~~~~~~~
compilation terminated.
dh_auto_build: cd obj-x86_64-linux-gnu && go install -gcflags=all=\"-trimpath=/<<PKGBUILDDIR>>/obj-x86_64-linux-gnu/src\" -asmflags=all=\"-trimpath=/<<PKGBUILDDIR>>/obj-x86_64-linux-gnu/src\" -v -p 4 github.com/mattn/go-sqlite3 github.com/mattn/go-sqlite3/upgrade returned exit code 2
make: *** [debian/rules:7: build] Error 255
dpkg-buildpackage: error: debian/rules build subprocess returned exit status 2
--------------------------------------------------------------------------------

Summary

Merged new upstream version: 1.11.0 (was: 1.6.0~ds1).

Full worker log Full build log