Run of fresh-snapshots for golang-github-miekg-pkcs11

Try this locally (using silver-platter):

debian-svp new-upstream --snapshot golang-github-miekg-pkcs11 
1
2
3
4
5
6
7
8
9
10
11
12
13
14
15
16
17
18
19
20
21
22
23
24
25
26
27
28
29
30
31
32
33
34
35
36
37
38
39
40
41
42
43
44
45
46
47
48
49
50
51
52
53
54
55
56
57
58
59
60
Processing: golang-github-miekg-pkcs11
Total 197 (delta 117), reused 194 (delta 114)
/usr/lib/python3/dist-packages/debian/copyright.py:652: UserWarning: Fixing Format URL
  warnings.warn('Fixing Format URL')
Using upstream branch https://github.com/miekg/pkcs11 (guessed)
  35% (6/17)   
Total 1129 (delta 11), reused 25 (delta 11), pack-reused 1101
Using version string 1.0.2+git20190429.a667d05.
No upstream upstream-revision format specified, trying git:a667d05
No upstream upstream-revision format specified, trying git:a667d05
Exporting upstream branch revision b'git-v1:a667d056470f6e0da7facaff2466f0d2645e35d7' to create the tarball
  35% (6/17)   
Total 1129 (delta 11), reused 25 (delta 11), pack-reused 1101
Not storing pristine-tar metadata, since there is no pristine-tar branch.
All changes applied successfully.
Committing to: /home/janitor/tmp/tmp3qwmn35a/golang-github-miekg-pkcs11/
added .gitignore
modified .travis.yml
added Makefile.release
modified README.md
modified const.go
modified debian/changelog
added go.mod
added p11
added p11/crypto.go
added p11/module.go
added p11/object.go
added p11/secret_key.go
added p11/session.go
added p11/slot.go
modified parallel_test.go
added params.go
added params_test.go
modified pkcs11.go
modified pkcs11.h
modified pkcs11_test.go
modified pkcs11f.h
added pkcs11go.h
modified pkcs11t.h
added release.go
added softhsm2.conf
added test_data
added test_data/a24d090e-196a-ccd7-5b05-6e9cc42d3142
added test_data/a24d090e-196a-ccd7-5b05-6e9cc42d3142/token.object
modified types.go
added vendor.go
Committed revision 30.
Worker failed: An error (1) occurred refreshing quilt patches: None

Applying patch debian/patches/unembed-nss.patch
patching file pkcs11.go
Hunk #1 FAILED at 17.
Hunk #2 FAILED at 771.
2 out of 2 hunks FAILED -- rejects in file pkcs11.go
patching file types.go
Hunk #1 FAILED at 5.
1 out of 1 hunk FAILED -- rejects in file types.go
Patch debian/patches/unembed-nss.patch does not apply (enforce with -f)

Elapsed time: 0:00:22.915727

Full worker log