Run of fresh-snapshots for golang-github-pzhin-go-sophia

Try this locally (using silver-platter):

debian-svp new-upstream --snapshot golang-github-pzhin-go-sophia 
783
784
785
786
787
788
789
790
791
792
793
794
795
796
797
/usr/include/x86_64-linux-gnu/bits/stdio2.h:67:10: note: ‘__builtin___snprintf_chk’ output 2 or more bytes (assuming 257) into a destination of size 256
   67 |   return __builtin___snprintf_chk (__s, __n, __USE_FORTIFY_LEVEL - 1,
      |          ^~~~~~~~~~~~~~~~~~~~~~~~~~~~~~~~~~~~~~~~~~~~~~~~~~~~~~~~~~~~
   68 |        __bos (__s), __fmt, __va_arg_pack ());
      |        ~~~~~~~~~~~~~~~~~~~~~~~~~~~~~~~~~~~~~
github.com/pzhin/go-sophia/manual_tests/issue2
# github.com/pzhin/go-sophia/manual_tests/issue2
/usr/bin/ld: $WORK/b008/_pkg1_.a(_x005.o): undefined reference to symbol 'pthread_join@@GLIBC_2.2.5'
/usr/bin/ld: /lib/x86_64-linux-gnu/libpthread.so.0: error adding symbols: DSO missing from command line
collect2: error: ld returned 1 exit status
dh_auto_build: error: cd obj-x86_64-linux-gnu && go install -trimpath -v -p 32 github.com/pzhin/go-sophia github.com/pzhin/go-sophia/manual_tests/issue2 returned exit code 2
make: *** [debian/rules:4: build] Error 25
dpkg-buildpackage: error: debian/rules build subprocess returned exit status 2
--------------------------------------------------------------------------------
Build finished at 2021-04-09T13:14:32Z

Summary

Merged new upstream version: 0.0~git20191015.1.afcd224 (was: 0.0~git20191015.0.afcd224).

Full worker log Full build log Full dist log