Run of fresh-snapshots for golang-github-sanity-io-litter

Try this locally (using silver-platter):

debian-svp new-upstream --snapshot golang-github-sanity-io-litter 
826
827
828
829
830
831
832
833
834
835
836
837
838
839
840
    --- PASS: TestSdump_multipleArgs/multipleArgs_lineBreak (0.00s)
    --- PASS: TestSdump_multipleArgs/multipleArgs_separator (0.00s)
=== RUN   TestSdump_maps
=== RUN   TestSdump_maps/maps
--- PASS: TestSdump_maps (0.00s)
    --- PASS: TestSdump_maps/maps (0.00s)
FAIL
FAIL	github.com/sanity-io/litter	0.148s
FAIL
dh_auto_test: error: cd obj-x86_64-linux-gnu && go test -vet=off -v -p 32 github.com/sanity-io/litter returned exit code 1
make: *** [debian/rules:4: binary] Error 25
dpkg-buildpackage: error: debian/rules binary subprocess returned exit status 2
--------------------------------------------------------------------------------
Build finished at 2021-04-09T11:06:29Z

Summary

Merged new upstream version: 1.5.0 (was: 1.3.0).

Full worker log Full build log Full dist log