Run of fresh-snapshots for golang-github-shirou-gopsutil

Try this locally (using silver-platter):

debian-svp new-upstream --snapshot golang-github-shirou-gopsutil 
24
25
26
27
28
29
30
31
32
33
34
1 out of 1 hunk FAILED
patching file cpu/cpu_test.go
Hunk #1 FAILED at 78.
1 out of 1 hunk FAILED
dpkg-source: info: the patch has fuzz which is not allowed, or is malformed
dpkg-source: info: if patch '01-Disable_failing_tests.patch' is correctly applied by quilt, use 'quilt refresh' to update it
dpkg-source: error: LC_ALL=C patch -t -F 0 -N -p1 -u -V never -E -b -B .pc/01-Disable_failing_tests.patch/ --reject-file=- < golang-github-shirou-gopsutil-3.21.3+git20210419.1.c7a38de.orig.pNuicA/debian/patches/01-Disable_failing_tests.patch subprocess returned exit status 1
E: Failed to open build log /tmp/janitore5gg0p3c/build-area//tmp/janitore5gg0p3c/build-area/golang-github-shirou-gopsutil_3.21.3+git20210419.1.c7a38de-1~jan+nus1.dsc_amd64-2021-04-24T09:17:00Z.build: No such file or directory
print() on closed filehandle $PLOG at /usr/share/perl5/Sbuild/Base.pm line 90.
E: unable to mktemp
brz: ERROR: The build failed.

Summary

Merged new upstream version: 3.21.3+git20210419.1.c7a38de (was: 2.19.11).

Full worker log Full build log Full dist log