Run of fresh-snapshots for golang-github-spf13-viper

762
763
764
765
766
767
768
769
770
771
772
773
774
775
776
 debian/rules binary
dh binary --builddirectory=_build --buildsystem=golang
   dh_update_autotools_config -O--builddirectory=_build -O--buildsystem=golang
   dh_autoreconf -O--builddirectory=_build -O--buildsystem=golang
   dh_auto_configure -O--builddirectory=_build -O--buildsystem=golang
   dh_auto_build -O--builddirectory=_build -O--buildsystem=golang
	cd _build && go install -trimpath -v -p 2 github.com/spf13/viper github.com/spf13/viper/internal/encoding github.com/spf13/viper/internal/encoding/dotenv github.com/spf13/viper/internal/encoding/hcl github.com/spf13/viper/internal/encoding/ini github.com/spf13/viper/internal/encoding/javaproperties github.com/spf13/viper/internal/encoding/json github.com/spf13/viper/internal/encoding/toml github.com/spf13/viper/internal/encoding/yaml github.com/spf13/viper/internal/testutil
src/github.com/spf13/viper/internal/encoding/toml/codec2.go:7:2: cannot find package "github.com/pelletier/go-toml/v2" in any of:
	/usr/src/github.com/pelletier/go-toml/v2 (from $GOROOT)
	/<<PKGBUILDDIR>>/_build/src/github.com/pelletier/go-toml/v2 (from $GOPATH)
dh_auto_build: error: cd _build && go install -trimpath -v -p 2 github.com/spf13/viper github.com/spf13/viper/internal/encoding github.com/spf13/viper/internal/encoding/dotenv github.com/spf13/viper/internal/encoding/hcl github.com/spf13/viper/internal/encoding/ini github.com/spf13/viper/internal/encoding/javaproperties github.com/spf13/viper/internal/encoding/json github.com/spf13/viper/internal/encoding/toml github.com/spf13/viper/internal/encoding/yaml github.com/spf13/viper/internal/testutil returned exit code 1
make: *** [debian/rules:7: binary] Error 25
dpkg-buildpackage: error: debian/rules binary subprocess returned exit status 2
--------------------------------------------------------------------------------
Build finished at 2022-09-29T22:55:54Z

Publish Blockers

  • ☒ run was not successful
  • ☑ package has not been removed from the archive
  • ☑ command has not changed
  • ☒ not yet reviewed, but review needed
  • ☑ 0 publish attempts so far.not currently attempting to back off
  • ☒ merge proposals for the package maintainer are currently being rate-limited (open: 1413, max open: 300)
  • ☒ change set f0682269-25d6-4f27-8247-a3c1edb6d8d9 is working

Full worker log Full build log