Run of fresh-releases for golang-golang-x-xerrors

Try this locally (using silver-platter):

debian-svp new-upstream golang-golang-x-xerrors 
744
745
746
747
748
749
750
751
752
753
754
755
756
757
758
=== RUN   ExampleNew_errorf
--- PASS: ExampleNew_errorf (0.00s)
=== RUN   ExampleAs
--- PASS: ExampleAs (0.00s)
=== RUN   Example
--- PASS: Example (0.00s)
FAIL
FAIL	golang.org/x/xerrors	0.181s
?   	golang.org/x/xerrors/internal	[no test files]
FAIL
dh_auto_test: error: cd obj-x86_64-linux-gnu && go test -vet=off -v -p 32 golang.org/x/xerrors golang.org/x/xerrors/internal returned exit code 1
make: *** [debian/rules:4: binary] Error 25
dpkg-buildpackage: error: debian/rules binary subprocess returned exit status 2
--------------------------------------------------------------------------------
Build finished at 2021-04-09T21:33:52Z

Summary

Merged new upstream version: 0.0~git20200804.5ec99f8 (was: 0.0~git20191204.9bdfabe).

Full worker log Full build log