Run of lintian-fixes for golang-gopkg-hlandau-acmeapi.v2

Try this locally (using the lintian-brush package):

debcheckout golang-gopkg-hlandau-acmeapi.v2
cd golang-gopkg-hlandau-acmeapi.v2
lintian-brush
612
613
614
615
616
617
618
619
620
621
622
623
624
625
626
627
go build golang.org/x/net/idna: no Go files in /usr/src/golang.org/x/net/idna
gopkg.in/square/go-jose.v1/cipher
gopkg.in/square/go-jose.v1/json
golang.org/x/crypto/ed25519
golang.org/x/crypto/pbkdf2
gopkg.in/square/go-jose.v2/cipher
gopkg.in/square/go-jose.v2/json
gopkg.in/hlandau/acmeapi.v2/pebbletest
gopkg.in/square/go-jose.v1
gopkg.in/square/go-jose.v2
github.com/mattn/go-isatty
github.com/hlandau/xlog
gopkg.in/hlandau/acmeapi.v2/acmeendpoints
dh_auto_build: error: cd _build && go install -trimpath -v -p 4 gopkg.in/hlandau/acmeapi.v2 gopkg.in/hlandau/acmeapi.v2/acmeendpoints gopkg.in/hlandau/acmeapi.v2/acmeutils gopkg.in/hlandau/acmeapi.v2/pebbletest returned exit code 1
make: *** [debian/rules:4: binary] Error 25
dpkg-buildpackage: error: debian/rules binary subprocess returned exit status 2

Summary

Full build log Full worker log