Run of fresh-snapshots for grapefruit

Try this locally (using silver-platter):

debian-svp new-upstream --snapshot grapefruit 
1
2
3
4
5
6
7
8
9
10
11
12
13
14
15
16
17
18
19
20
21
22
23
24
25
26
27
28
29
30
31
32
33
34
35
36
37
38
39
40
41
42
43
44
45
46
47
48
49
50
51
52
53
54
55
56
57
58
59
60
61
62
63
64
Processing: grapefruit
(98/238)   
   
0% (238/238), done.
Total 238 (delta 129), reused 206 (delta 106)
Total 4 (delta 0), reused 4 (delta 0)
Total 0 (delta 0), reused 0 (delta 0)
Using upstream branch https://github.com/xav/grapefruit (guessed)
Total 254 (delta 0), reused 0 (delta 0), pack-reused 254
Using version string 0.1~a3+dfsg+git20160817.b3d8837.
Exporting upstream branch revision b'git-v1:b3d88375be727a3a1ec5839fbc462e0e8e0836e4' to create the tarball
Total 254 (delta 0), reused 0 (delta 0), pack-reused 254
release_0.1a1 does not point to a valid object
release_0.1a2 does not point to a valid object
All changes applied successfully.
Committing to: /home/janitor/tmp/tmp5tg89iaw/grapefruit/
added .gitchangelog.rc
added .gitignore
added .travis.yml
deleted CHANGES
deleted COPYING
modified LICENSE
deleted PKG-INFO
deleted README
added README.rst
modified TODO
modified debian/changelog
modified doc/Makefile
added doc/_static
added doc/_static/GrapeFruit.png
modified doc/conf.py
modified doc/index.rst
modified doc/makedoc.cmd
modified grapefruit.py
modified grapefruit_test.py
added requirements.txt
modified setup.cfg
modified setup.py
Committed revision 23.
Worker failed: An error occurred refreshing quilt patch fix-typos: 

Applying patch debian/patches/fix-typos
patching file doc/index.rst
patching file grapefruit.py
Hunk #1 FAILED at 1111.
Hunk #2 FAILED at 1138.
Hunk #3 FAILED at 1165.
Hunk #4 FAILED at 1193.
Hunk #5 FAILED at 1220.
Hunk #6 FAILED at 1247.
Hunk #7 FAILED at 1274.
Hunk #8 FAILED at 1305.
Hunk #9 FAILED at 1332.
Hunk #10 FAILED at 1361.
Hunk #11 FAILED at 1392.
Hunk #12 FAILED at 1834.
12 out of 12 hunks FAILED -- rejects in file grapefruit.py
patching file grapefruit_test.py
Hunk #1 FAILED at 28 (different line endings).
Hunk #2 FAILED at 112 (different line endings).
2 out of 2 hunks FAILED -- rejects in file grapefruit_test.py
Patch debian/patches/fix-typos does not apply (enforce with -f)

Elapsed time: 0:01:19.521735

Full worker log