Run of fresh-releases for gtts

Try this locally (using silver-platter):

debian-svp new-upstream gtts 
1
2
3
4
5
6
7
8
9
10
11
12
13
14
15
16
17
18
19
20
21
22
23
24
25
26
27
28
29
30
31
32
33
34
35
36
37
38
39
40
41
42
43
44
45
46
47
48
49
50
51
52
53
54
55
56
57
58
59
60
61
62
63
64
65
66
67
68
69
70
71
72
73
74
75
76
77
78
79
80
81
82
83
84
85
86
87
88
89
90
91
92
93
94
95
96
97
98
99
100
101
102
103
104
105
106
107
108
109
110
111
112
113
114
115
116
117
118
119
120
121
122
123
124
125
126
127
128
129
130
131
132
133
134
135
136
137
138
139
140
141
142
143
144
145
146
147
148
149
150
151
152
153
154
155
156
157
158
159
160
161
162
163
164
165
166
167
168
169
170
171
172
173
174
175
176
177
178
179
180
181
182
183
184
185
186
187
188
189
190
191
192
193
194
195
196
197
198
199
200
201
202
203
204
205
206
207
208
209
210
211
212
213
214
215
216
217
218
219
220
221
222
Processing: gtts
2/141)   
git: refs/tags/debian/1.2.0-1 does not point to a valid object!
Total 155 (delta 22), reused 133 (delta 0)
Using upstream branch https://github.com/pndurette/gTTS (guessed)
Total 1293 (delta 0), reused 0 (delta 0), pack-reused 1293
Using version string 2.0.3.
No upstream upstream-revision format specified, trying tag:2.0.3
No upstream upstream-revision format specified, trying tag:gtts-2.0.3
No upstream upstream-revision format specified, trying tag:v2.0.3
Using uscan to look for the upstream tarball.
Total 1203 (delta 4), reused 4 (delta 4), pack-reused 1198
/usr/lib/python3/dist-packages/dulwich/repo.py:393: UserWarning: ref refs/tags/v1.0 points at non-present sha 26114e1c2dc19cecabfe5f0592bebb166062b4f0
  UserWarning)
/usr/lib/python3/dist-packages/dulwich/repo.py:393: UserWarning: ref refs/tags/v1.1.8 points at non-present sha 25a4c50caa98a808ff9d6dbcfa0fa5edf18e121a
  UserWarning)
/usr/lib/python3/dist-packages/dulwich/repo.py:393: UserWarning: ref refs/tags/v1.0.4 points at non-present sha f9994c4f35d6b4040693058bcebf8e38081d2dff
  UserWarning)
/usr/lib/python3/dist-packages/dulwich/repo.py:393: UserWarning: ref refs/tags/v1.0.1 points at non-present sha 261b5495937f3ff85b54d4ee46cbed4648676c51
  UserWarning)
/usr/lib/python3/dist-packages/dulwich/repo.py:393: UserWarning: ref refs/tags/v1.0.3 points at non-present sha 5a0b93e71cf94dcb1691c0d7fe208f48282b7bc3
  UserWarning)
/usr/lib/python3/dist-packages/dulwich/repo.py:393: UserWarning: ref refs/tags/v1.1.4 points at non-present sha cafc8430d2d84a87aae46b378a80ae6dcac901ee
  UserWarning)
/usr/lib/python3/dist-packages/dulwich/repo.py:393: UserWarning: ref refs/tags/v2.0.2 points at non-present sha b2cdc0b8ee555efde024ccd03c728545d1f18d59
  UserWarning)
/usr/lib/python3/dist-packages/dulwich/repo.py:393: UserWarning: ref refs/tags/v1.1.3 points at non-present sha 3e2789cea745dffcde0a6ad187ccb82c39d2c5a7
  UserWarning)
/usr/lib/python3/dist-packages/dulwich/repo.py:393: UserWarning: ref refs/tags/v1.1.6 points at non-present sha 25b07537e9a54706ce9371f6bdf7721606f7042e
  UserWarning)
/usr/lib/python3/dist-packages/dulwich/repo.py:393: UserWarning: ref refs/tags/v1.0.5 points at non-present sha 957e98153e7ef3cfc4ec858341d846c7fc2581a1
  UserWarning)
/usr/lib/python3/dist-packages/dulwich/repo.py:393: UserWarning: ref refs/tags/v1.0.2 points at non-present sha 979dc1a9eaf6b6f7cdea80ed3fc56ba74cd5773f
  UserWarning)
/usr/lib/python3/dist-packages/dulwich/repo.py:393: UserWarning: ref refs/tags/v1.1.0 points at non-present sha 98b2ee8abf0a55e832cafb4380c971cf80261081
  UserWarning)
/usr/lib/python3/dist-packages/dulwich/repo.py:393: UserWarning: ref refs/tags/v2.0.1 points at non-present sha ebd2061d16f63c5c6239ffb9987e604e9fe6f383
  UserWarning)
/usr/lib/python3/dist-packages/dulwich/repo.py:393: UserWarning: ref refs/tags/v1.2.2 points at non-present sha b755310e59ee3f44ccc1c440afffc715fc4be496
  UserWarning)
/usr/lib/python3/dist-packages/dulwich/repo.py:393: UserWarning: ref refs/tags/v1.1.2 points at non-present sha dab3b174f186dcac9de00fe481a4dc41f7d7591f
  UserWarning)
/usr/lib/python3/dist-packages/dulwich/repo.py:393: UserWarning: ref refs/tags/v1.0.6 points at non-present sha 47372f320a000ecd50b2ba134c7d04cf98ce5216
  UserWarning)
/usr/lib/python3/dist-packages/dulwich/repo.py:393: UserWarning: ref refs/tags/v1.2.1 points at non-present sha 46c4da96d1af06fd83fc6663ec7a987f4c598570
  UserWarning)
/usr/lib/python3/dist-packages/dulwich/repo.py:393: UserWarning: ref refs/tags/v2.0.0 points at non-present sha 516fa6e2469faf31e19c7aac803c798ed6eb9377
  UserWarning)
/usr/lib/python3/dist-packages/dulwich/repo.py:393: UserWarning: ref refs/tags/v1.1.7 points at non-present sha 397c3611b462bfb076ecdca121689cf45bc15cb3
  UserWarning)
/usr/lib/python3/dist-packages/dulwich/repo.py:393: UserWarning: ref refs/tags/v1.1.5 points at non-present sha 6a37fbfe270d9e707a974b2c961becaa91224777
  UserWarning)
/usr/lib/python3/dist-packages/dulwich/repo.py:393: UserWarning: ref refs/tags/v1.2.0 points at non-present sha 9fcd9049261a73d3351bfd14c9c7dbaa48eeed54
  UserWarning)
/usr/lib/python3/dist-packages/dulwich/repo.py:393: UserWarning: ref refs/tags/v1.0.7 points at non-present sha 28fad1c361fb40e0a76440af8d99df575d375052
  UserWarning)
Not storing pristine-tar metadata, since there is no pristine-tar branch.
/usr/lib/python3/dist-packages/dulwich/repo.py:393: UserWarning: ref refs/tags/v1.0 points at non-present sha 26114e1c2dc19cecabfe5f0592bebb166062b4f0
  UserWarning)
/usr/lib/python3/dist-packages/dulwich/repo.py:393: UserWarning: ref refs/tags/v1.1.8 points at non-present sha 25a4c50caa98a808ff9d6dbcfa0fa5edf18e121a
  UserWarning)
/usr/lib/python3/dist-packages/dulwich/repo.py:393: UserWarning: ref refs/tags/v1.0.4 points at non-present sha f9994c4f35d6b4040693058bcebf8e38081d2dff
  UserWarning)
/usr/lib/python3/dist-packages/dulwich/repo.py:393: UserWarning: ref refs/tags/v1.0.1 points at non-present sha 261b5495937f3ff85b54d4ee46cbed4648676c51
  UserWarning)
/usr/lib/python3/dist-packages/dulwich/repo.py:393: UserWarning: ref refs/tags/v1.0.3 points at non-present sha 5a0b93e71cf94dcb1691c0d7fe208f48282b7bc3
  UserWarning)
/usr/lib/python3/dist-packages/dulwich/repo.py:393: UserWarning: ref refs/tags/v1.1.4 points at non-present sha cafc8430d2d84a87aae46b378a80ae6dcac901ee
  UserWarning)
/usr/lib/python3/dist-packages/dulwich/repo.py:393: UserWarning: ref refs/tags/v2.0.2 points at non-present sha b2cdc0b8ee555efde024ccd03c728545d1f18d59
  UserWarning)
/usr/lib/python3/dist-packages/dulwich/repo.py:393: UserWarning: ref refs/tags/v1.1.3 points at non-present sha 3e2789cea745dffcde0a6ad187ccb82c39d2c5a7
  UserWarning)
/usr/lib/python3/dist-packages/dulwich/repo.py:393: UserWarning: ref refs/tags/v1.1.6 points at non-present sha 25b07537e9a54706ce9371f6bdf7721606f7042e
  UserWarning)
/usr/lib/python3/dist-packages/dulwich/repo.py:393: UserWarning: ref refs/tags/v1.0.5 points at non-present sha 957e98153e7ef3cfc4ec858341d846c7fc2581a1
  UserWarning)
/usr/lib/python3/dist-packages/dulwich/repo.py:393: UserWarning: ref refs/tags/v1.0.2 points at non-present sha 979dc1a9eaf6b6f7cdea80ed3fc56ba74cd5773f
  UserWarning)
/usr/lib/python3/dist-packages/dulwich/repo.py:393: UserWarning: ref refs/tags/v1.1.0 points at non-present sha 98b2ee8abf0a55e832cafb4380c971cf80261081
  UserWarning)
/usr/lib/python3/dist-packages/dulwich/repo.py:393: UserWarning: ref refs/tags/v2.0.1 points at non-present sha ebd2061d16f63c5c6239ffb9987e604e9fe6f383
  UserWarning)
/usr/lib/python3/dist-packages/dulwich/repo.py:393: UserWarning: ref refs/tags/v1.2.2 points at non-present sha b755310e59ee3f44ccc1c440afffc715fc4be496
  UserWarning)
/usr/lib/python3/dist-packages/dulwich/repo.py:393: UserWarning: ref refs/tags/v1.1.2 points at non-present sha dab3b174f186dcac9de00fe481a4dc41f7d7591f
  UserWarning)
/usr/lib/python3/dist-packages/dulwich/repo.py:393: UserWarning: ref refs/tags/v1.0.6 points at non-present sha 47372f320a000ecd50b2ba134c7d04cf98ce5216
  UserWarning)
/usr/lib/python3/dist-packages/dulwich/repo.py:393: UserWarning: ref refs/tags/v1.2.1 points at non-present sha 46c4da96d1af06fd83fc6663ec7a987f4c598570
  UserWarning)
/usr/lib/python3/dist-packages/dulwich/repo.py:393: UserWarning: ref refs/tags/v2.0.0 points at non-present sha 516fa6e2469faf31e19c7aac803c798ed6eb9377
  UserWarning)
/usr/lib/python3/dist-packages/dulwich/repo.py:393: UserWarning: ref refs/tags/v1.1.7 points at non-present sha 397c3611b462bfb076ecdca121689cf45bc15cb3
  UserWarning)
/usr/lib/python3/dist-packages/dulwich/repo.py:393: UserWarning: ref refs/tags/v1.1.5 points at non-present sha 6a37fbfe270d9e707a974b2c961becaa91224777
  UserWarning)
/usr/lib/python3/dist-packages/dulwich/repo.py:393: UserWarning: ref refs/tags/v1.2.0 points at non-present sha 9fcd9049261a73d3351bfd14c9c7dbaa48eeed54
  UserWarning)
/usr/lib/python3/dist-packages/dulwich/repo.py:393: UserWarning: ref refs/tags/v1.0.7 points at non-present sha 28fad1c361fb40e0a76440af8d99df575d375052
  UserWarning)
v1.0 does not point to a valid object
v1.1.8 does not point to a valid object
v1.0.4 does not point to a valid object
v1.0.1 does not point to a valid object
v1.0.3 does not point to a valid object
v1.1.4 does not point to a valid object
v2.0.2 does not point to a valid object
v1.1.3 does not point to a valid object
v1.1.6 does not point to a valid object
v1.0.5 does not point to a valid object
v1.0.2 does not point to a valid object
v1.1.0 does not point to a valid object
v2.0.1 does not point to a valid object
v1.2.2 does not point to a valid object
v2.0.3 does not point to a valid object
v1.1.2 does not point to a valid object
v1.0.6 does not point to a valid object
v1.2.1 does not point to a valid object
v2.0.0 does not point to a valid object
v1.1.7 does not point to a valid object
v1.1.5 does not point to a valid object
v1.2.0 does not point to a valid object
v1.0.7 does not point to a valid object
All changes applied successfully.
v1.0 does not point to a valid object
v1.1.8 does not point to a valid object
v1.0.4 does not point to a valid object
v1.0.1 does not point to a valid object
v1.0.3 does not point to a valid object
v1.1.4 does not point to a valid object
v2.0.2 does not point to a valid object
v1.1.3 does not point to a valid object
v1.1.6 does not point to a valid object
v1.0.5 does not point to a valid object
v1.0.2 does not point to a valid object
v1.1.0 does not point to a valid object
v2.0.1 does not point to a valid object
v1.2.2 does not point to a valid object
v2.0.3 does not point to a valid object
v1.1.2 does not point to a valid object
v1.0.6 does not point to a valid object
v1.2.1 does not point to a valid object
v2.0.0 does not point to a valid object
v1.1.7 does not point to a valid object
v1.1.5 does not point to a valid object
v1.2.0 does not point to a valid object
v1.0.7 does not point to a valid object
Committing to: /home/janitor/tmp/tmpqam30ehu/gtts/
deleted CHANGELOG.md
added CHANGELOG.rst
added CONTRIBUTING.rst
added LICENSE
modified MANIFEST.in
modified PKG-INFO
modified README.md
deleted bin
deleted bin/gtts-cli
deleted bin/gtts-cli.py
modified debian/changelog
modified gTTS.egg-info/PKG-INFO
modified gTTS.egg-info/SOURCES.txt
added gTTS.egg-info/entry_points.txt
modified gTTS.egg-info/requires.txt
modified gtts/__init__.py
added gtts/cli.py
added gtts/lang.py
added gtts/tests
added gtts/tests/__init__.py
added gtts/tests/test_cli.py
added gtts/tests/test_lang.py
added gtts/tests/test_tts.py
added gtts/tests/test_utils.py
added gtts/tokenizer
added gtts/tokenizer/__init__.py
added gtts/tokenizer/core.py
added gtts/tokenizer/pre_processors.py
added gtts/tokenizer/symbols.py
added gtts/tokenizer/tokenizer_cases.py
modified gtts/tts.py
added gtts/utils.py
modified gtts/version.py
modified setup.cfg
modified setup.py
Committed revision 26.
Worker failed: An error (1) occurred refreshing quilt patches: None

Applying patch debian/patches/0001-Change-binary-to-be-pure-python.patch
can't find file to patch at input line 17
Perhaps you used the wrong -p or --strip option?
The text leading up to this was:
--------------------------
|From: Ethan Ward <ethan.ward@mycroft.ai>
|Date: Fri, 4 Aug 2017 14:05:48 -0500
|Subject: Change binary to be pure python
|
|Remove .py file from scripts
|---
| bin/gtts-cli    | 56 ++++++++++++++++++++++++++++++++++++++++++++++++++++----
| bin/gtts-cli.py | 52 ----------------------------------------------------
| setup.py        |  2 +-
| 3 files changed, 53 insertions(+), 57 deletions(-)
| delete mode 100755 bin/gtts-cli.py
|
|diff --git a/bin/gtts-cli b/bin/gtts-cli
|index dc25393..f3657d0 100755
|--- a/bin/gtts-cli
|+++ b/bin/gtts-cli
--------------------------
No file to patch.  Skipping patch.
1 out of 1 hunk ignored
The next patch would delete the file bin/gtts-cli.py,
which does not exist!  Applying it anyway.
patching file bin/gtts-cli.py
Hunk #1 FAILED at 1.
1 out of 1 hunk FAILED -- rejects in file bin/gtts-cli.py
patching file setup.py
Hunk #1 FAILED at 12.
1 out of 1 hunk FAILED -- rejects in file setup.py
Patch debian/patches/0001-Change-binary-to-be-pure-python.patch does not apply (enforce with -f)

Elapsed time: 0:00:26.478416

Full worker log