Run of fresh-snapshots for howardhinnant-date

1035
1036
1037
1038
1039
1040
1041
1042
1043
1044
1045
1046
1047
1048
1049
-- Installing: /<<PKGBUILDDIR>>/debian/tmp/usr/lib/x86_64-linux-gnu/cmake/date/dateTargets.cmake
-- Installing: /<<PKGBUILDDIR>>/debian/tmp/usr/lib/x86_64-linux-gnu/cmake/date/dateTargets-none.cmake
-- Installing: /<<PKGBUILDDIR>>/debian/tmp/usr/lib/x86_64-linux-gnu/cmake/date/dateConfig.cmake
-- Installing: /<<PKGBUILDDIR>>/debian/tmp/usr/lib/x86_64-linux-gnu/cmake/date/dateConfigVersion.cmake
make[1]: Leaving directory '/<<PKGBUILDDIR>>/obj-x86_64-linux-gnu'
   dh_install
   dh_installdocs
dh_installdocs: error: Cannot find (any matches for) "docs/*" (tried in ., debian/tmp)

make: *** [debian/rules:14: binary] Error 25
dpkg-buildpackage: error: debian/rules binary subprocess returned exit status 2
--------------------------------------------------------------------------------
Build finished at 2022-09-25T00:52:56Z

Finished

Publish Blockers

  • ☒ run was not successful
  • ☑ package has not been removed from the archive
  • ☑ command has not changed
  • ☒ not yet reviewed, but review needed
  • ☑ 0 publish attempts so far. not currently attempting to back off
  • ☒ merge proposals for the package maintainer are currently being rate-limited (open: 1195, max open: 200)
  • ☒ change set 537007f9-9605-4ef3-b43a-d263f0d1a17e is working

Full worker log Full build log