Run of fresh-snapshots for httpcomponents-core

Try this locally (using silver-platter):

debian-svp new-upstream --snapshot httpcomponents-core 
902
903
904
905
906
907
908
909
910
911
912
dpkg-source: error: cannot represent change to httpcore5/src/test/resources/test-client.p12: binary file contents changed
dpkg-source: error: add httpcore5/src/test/resources/test-client.p12 in debian/source/include-binaries if you want to store the modified binary in the debian tarball
dpkg-source: error: cannot represent change to httpcore5/src/test/resources/test-keypasswd.p12: binary file contents changed
dpkg-source: error: add httpcore5/src/test/resources/test-keypasswd.p12 in debian/source/include-binaries if you want to store the modified binary in the debian tarball
dpkg-source: error: cannot represent change to httpcore5/src/test/resources/test-server.p12: binary file contents changed
dpkg-source: error: add httpcore5/src/test/resources/test-server.p12 in debian/source/include-binaries if you want to store the modified binary in the debian tarball
dpkg-source: error: cannot represent change to httpcore5/src/test/resources/test.p12: binary file contents changed
dpkg-source: error: add httpcore5/src/test/resources/test.p12 in debian/source/include-binaries if you want to store the modified binary in the debian tarball
dpkg-source: warning: file httpcomponents-core-4.4.13/test-CA/README.txt has no final newline (either original or modified version)
E: Failed to package source directory /home/janitor/tmp/tmpmd2v_i_g/build-area/httpcomponents-core-4.4.13
brz: ERROR: The build failed.

Summary

Merged new upstream version: 4.4.13+git20201106.5d413a4 (was: 4.4.13).

Full worker log Full build log