Run of fresh-snapshots for ipykernel

1085
1086
1087
1088
1089
1090
1091
1092
1093
1094
1095
1096
1097
1098
1099
    _ns = select_backend(first)
  File "/usr/lib/python3/dist-packages/zmq/backend/select.py", line 32, in select_backend
    mod = import_module(name)
  File "/usr/lib/python3.10/importlib/__init__.py", line 126, in import_module
    return _bootstrap._gcd_import(name[level:], package, level)
  File "/usr/lib/python3/dist-packages/zmq/backend/cython/__init__.py", line 6, in <module>
    from . import (
ImportError: libsodium.so.23: cannot open shared object file: No such file or directory
* Building wheel...

ERROR Backend subproccess exited when trying to invoke build_wheel
E: pybuild pybuild:379: build: plugin pyproject failed with: exit code=1: python3.10 -m build --skip-dependency-check --no-isolation --wheel --outdir /<<PKGBUILDDIR>>/.pybuild/cpython3_3.10 
dh_auto_build: error: pybuild --build -i python{version} -p 3.10 returned exit code 13
make: *** [debian/rules:8: binary] Error 25
dpkg-buildpackage: error: debian/rules binary subprocess returned exit status 2

Publish Blockers

  • ☒ run was not successful
  • ☑ package has not been removed from the archive
  • ☑ command has not changed
  • ☒ not yet reviewed, but review needed
  • ☑ 0 publish attempts so far. not currently attempting to back off
  • ☒ merge proposals for the package maintainer are currently being rate-limited (open: 1195, max open: 200)
  • ☒ change set c3782eee-3937-4e5a-8a5b-dec166ef20d9 is working

Full worker log Full build log