Run of fresh-snapshots for libdeflate

816
817
818
819
820
821
822
823
824
825
826
827
828
829
830
[100%] Linking C executable libdeflate-gzip
cd /<<PKGBUILDDIR>>/obj-x86_64-linux-gnu/programs && /usr/bin/cmake -E cmake_link_script CMakeFiles/libdeflate-gzip.dir/link.txt --verbose=1
/usr/bin/cc -g -O2 -ffile-prefix-map=/<<PKGBUILDDIR>>=. -fstack-protector-strong -Wformat -Werror=format-security -Wdate-time -D_FORTIFY_SOURCE=2 -Wl,-z,relro -Wl,-z,now "CMakeFiles/libdeflate-gzip.dir/gzip.c.o" -o libdeflate-gzip  libdeflate_prog_utils.a ../libdeflate.a 
make[4]: Leaving directory '/<<PKGBUILDDIR>>/obj-x86_64-linux-gnu'
[100%] Built target libdeflate-gzip
make[3]: Leaving directory '/<<PKGBUILDDIR>>/obj-x86_64-linux-gnu'
/usr/bin/cmake -E cmake_progress_start /<<PKGBUILDDIR>>/obj-x86_64-linux-gnu/CMakeFiles 0
make[2]: *** No rule to make target 'test_programs'.  Stop.
make[2]: Leaving directory '/<<PKGBUILDDIR>>/obj-x86_64-linux-gnu'
dh_auto_build: error: cd obj-x86_64-linux-gnu && make -j32 "INSTALL=install --strip-program=true" "CFLAGS=-g -O2 -ffile-prefix-map=/<<PKGBUILDDIR>>=. -fstack-protector-strong -Wformat -Werror=format-security -fprofile-generate" "LDFLAGS=-Wl,-z,relro -Wl,-z,now -fprofile-generate" "CPPFLAGS=-Wdate-time -D_FORTIFY_SOURCE=2" V=1 PREFIX=/usr DESTDIR=/<<BUILDDIR>>/libdeflate-1.14\+git20220928.1.03fba38/debian/tmp all test_programs VERBOSE=1 returned exit code 2
make[1]: *** [debian/rules:18: override_dh_auto_build] Error 25
make[1]: Leaving directory '/<<PKGBUILDDIR>>'
make: *** [debian/rules:8: binary] Error 2
dpkg-buildpackage: error: debian/rules binary subprocess returned exit status 2
--------------------------------------------------------------------------------

Publish Blockers

  • ☒ run was not successful
  • ☑ package has not been removed from the archive
  • ☑ command has not changed
  • ☑ review not required
  • ☑ 0 publish attempts so far. not currently attempting to back off
  • ☑ proposals not currently being rate-limited for maintainer None
  • ☒ change set 7ae3701f-e957-4ec3-950c-434fff3f846a is working

Full worker log Full build log ( 1 )