Run of fresh-snapshots for libjs-jsencrypt

Try this locally (using silver-platter):

debian-svp new-upstream --snapshot libjs-jsencrypt 
1
2
3
4
5
6
7
8
9
10
11
12
13
14
15
16
17
18
19
20
21
22
23
24
25
26
27
28
29
30
31
32
33
34
35
36
37
38
39
40
41
42
43
44
45
46
47
48
49
50
51
52
53
54
55
56
57
58
59
60
61
62
63
64
65
66
67
68
69
70
71
72
73
74
75
76
77
78
79
80
81
82
83
84
85
86
87
88
89
90
91
92
93
94
95
96
97
98
99
100
101
102
103
104
105
106
Processing: libjs-jsencrypt
0% (665/665), done.
209/243)   
Total 665 (delta 385), reused 662 (delta 382)
/usr/lib/python3/dist-packages/debian/copyright.py:652: UserWarning: Fixing Format URL
  warnings.warn('Fixing Format URL')
Using upstream branch git://github.com/travist/jsencrypt.git (guessed)
Total 393 (delta 60), reused 60 (delta 60), pack-reused 333
Using version string 3.0.0-rc.1+git20180627.ea32a51.
No upstream upstream-revision format specified, trying git:ea32a51
No upstream upstream-revision format specified, trying git:ea32a51
Exporting upstream branch revision b'git-v1:ea32a5161cfd79218fa30b4c8f661615d21b40a9' to create the tarball
Total 393 (delta 60), reused 60 (delta 60), pack-reused 333
Not storing pristine-tar metadata, since there is no pristine-tar branch.
All changes applied successfully.
Committing to: /home/janitor/tmp/tmpsa6_dij4/libjs-jsencrypt/
modified .gitignore
added .npmignore
added Gemfile
added Gemfile.lock
modified README.md
added bin
added bin/jsencrypt.js
added bin/jsencrypt.min.js
modified bower.json
modified debian/changelog
added declarations
added declarations/lib
added declarations/lib/asn1js
added declarations/lib/asn1js/asn1.d.ts
added declarations/lib/asn1js/base64.d.ts
added declarations/lib/asn1js/hex.d.ts
added declarations/lib/asn1js/int10.d.ts
added declarations/lib/jsbn
added declarations/lib/jsbn/base64.d.ts
added declarations/lib/jsbn/jsbn.d.ts
added declarations/lib/jsbn/prng4.d.ts
added declarations/lib/jsbn/rng.d.ts
added declarations/lib/jsbn/rsa.d.ts
added declarations/lib/jsbn/util.d.ts
added declarations/src
added declarations/src/JSEncrypt.d.ts
added declarations/src/JSEncryptRSAKey.d.ts
added declarations/src/index.d.ts
added demo
added demo/index.html
modified example.html
modified gulpfile.js
added jquery.js
deleted lib/asn1js/asn1.js
added lib/asn1js/asn1.ts
deleted lib/asn1js/base64.js
added lib/asn1js/base64.ts
deleted lib/asn1js/hex.js
added lib/asn1js/hex.ts
added lib/asn1js/int10.ts
modified lib/asn1js/oids.js
deleted lib/jsbn/base64.js
added lib/jsbn/base64.ts
deleted lib/jsbn/jsbn.js
added lib/jsbn/jsbn.ts
deleted lib/jsbn/jsbn2.js
deleted lib/jsbn/prng4.js
added lib/jsbn/prng4.ts
deleted lib/jsbn/rng.js
added lib/jsbn/rng.ts
deleted lib/jsbn/rsa-async.js
deleted lib/jsbn/rsa.js
added lib/jsbn/rsa.ts
deleted lib/jsbn/rsa2.js
added lib/jsbn/util.ts
added lib/jsrsasign/asn1-1.0.d.ts
modified lib/jsrsasign/asn1-1.0.js
added lib/jsrsasign/yahoo.js
added package-lock.json
modified package.json
added rollup.config.js
added src/JSEncrypt.ts
added src/JSEncryptRSAKey.ts
added src/index.ts
deleted src/jsencrypt.js
deleted src/template.txt
added stats.json
deleted test/expect.js
modified test/index.html
added test/libs
added test/libs/index.js
added test/libs/mocha.css
added test/libs/mocha.js
deleted test/mocha.css
deleted test/mocha.js
modified test/test.rsa.js
added tsconfig.json
added tslint.json
added webpack.config.js
Committed revision 55.
Worker failed: An error (1) occurred refreshing quilt patches: None

Applying patch debian/patches/disable-not-useful-gulp-calls.patch
patching file gulpfile.js
Hunk #1 FAILED at 1.
Hunk #2 FAILED at 33.
2 out of 2 hunks FAILED -- rejects in file gulpfile.js
Patch debian/patches/disable-not-useful-gulp-calls.patch does not apply (enforce with -f)

Elapsed time: 0:00:24.838115

Full worker log