Run of fresh-releases for libjxmpp-java

1
2
3
4
5
6
7
8
9
10
11
12
13
14
15
16
17
18
19
20
21
22
23
24
25
26
27
28
29
30
31
32
33
34
35
36
37
38
39
40
41
42
43
44
45
46
47
48
49
[2022-06-12 12:33:24] Opening branch at https://salsa.debian.org/debian/libjxmpp-java.git/,branch=master
[2022-06-12 12:33:25] Using cached branch https://janitor.debian.net/git/libjxmpp-java/,branch=debian%2Flatest
[2022-06-12 12:33:25] Using resume branch: https://janitor.debian.net/git/libjxmpp-java,branch=fresh-releases%2Fmain
[2022-06-12 12:33:27] 02)
[2022-06-12 12:33:27] Total 402 (delta 114), reused 241 (delta 0), pack-reused 0
[2022-06-12 12:33:28] (23/24)
[2022-06-12 12:33:28] Total 30 (delta 14), reused 0 (delta 0), pack-reused 0
[2022-06-12 12:33:29] All changes applied successfully.
[2022-06-12 12:33:29] Total 0 (delta 0), reused 0 (delta 0), pack-reused 0
[2022-06-12 12:33:29] Workspace ready - starting.
[2022-06-12 12:33:29] Running ['deb-new-upstream', '--refresh-patches']
Using upstream branch https://github.com/igniterealtime/jxmpp.git (from configuration)
Total 3970 (delta 128), reused 442 (delta 124), pack-reused 3518
Using version string 1.0.3.
No upstream upstream-revision format specified, trying tag:1.0.2
Not including upstream history, since previous upstream version (1.0.2) is not present in packaging branch history.
Using uscan to look for the upstream tarball.
Not storing pristine-tar metadata, since there is no pristine-tar branch.
All changes applied successfully.
Committing to: /tmp/janitori539i7af/libjxmpp-java/
modified build.gradle
modified debian/changelog
added jxmpp-core/src/main/java/org/jxmpp/xml/splitter/InvalidXmlException.java
modified jxmpp-core/src/main/java/org/jxmpp/xml/splitter/XmlSplitter.java
modified version
Committed revision 20.
Merged new upstream version 1.0.3 (previous: 1.0.2)
Refresh quilt patches.
An error occurred refreshing quilt patch 01-edit-build-system.patch: 

Applying patch debian/patches/01-edit-build-system.patch
patching file build.gradle
Hunk #1 FAILED at 6.
Hunk #2 succeeded at 46 (offset 1 line).
Hunk #3 succeeded at 80 (offset 1 line).
Hunk #4 succeeded at 133 (offset 1 line).
Hunk #5 succeeded at 159 (offset 1 line).
Hunk #6 FAILED at 195.
Hunk #7 succeeded at 228 (offset 10 lines).
Hunk #8 succeeded at 282 (offset 10 lines).
Hunk #9 succeeded at 293 (offset 10 lines).
Hunk #10 succeeded at 302 (offset 10 lines).
Hunk #11 succeeded at 329 (offset 10 lines).
Hunk #12 succeeded at 337 (offset 10 lines).
Hunk #13 succeeded at 391 (offset 10 lines).
2 out of 13 hunks FAILED -- rejects in file build.gradle
patching file settings.gradle
Patch debian/patches/01-edit-build-system.patch does not apply (enforce with -f)

Publish Blockers

  • ☒ run was not successful
  • ☑ package has not been removed from the archive
  • ☑ command has not changed
  • ☒ not yet reviewed, but review needed
  • ☑ 0 publish attempts so far.not currently attempting to back off
  • ☒ merge proposals for the package maintainer are currently being rate-limited (open: 1258, max open: 200)
  • ☒ change set 71a83502-f1ee-4064-938a-bd63abb3e361 is working

Full worker log