Run of fresh-releases for libkf5libkleo

1
2
3
4
5
6
7
8
9
10
11
12
13
14
15
16
17
18
19
20
21
22
23
24
25
26
27
28
29
30
31
32
33
34
35
36
37
38
39
40
41
42
43
44
45
46
47
48
49
50
51
52
53
54
55
56
57
58
59
60
61
62
Using upstream branch https://invent.kde.org/pim/libkleo.git (from configuration)
Total 6654 (delta 1974), reused 2030 (delta 1794), pack-reused 4411
Using version string 22.04.0.
No upstream upstream-revision format specified, trying tag:21.12.3
No upstream upstream-revision format specified, trying tag:libkf5libkleo-21.12.3
No upstream upstream-revision format specified, trying tag:v21.12.3
Not including upstream history, since previous upstream version (21.12.3) is not present in packaging branch history.
The changelog has been updated for the new version.
Committing to: /tmp/janitorzb0x6vri/libkf5libkleo/
modified debian/changelog
Committed revision 198.
Merged new upstream version 22.04.0 (previous: 21.12.3)
Merge new upstream version 22.04.0
Traceback (most recent call last):
  File "/code/ognibuild/ognibuild/debian/build.py", line 204, in build
    subprocess.check_call(
  File "/usr/lib/python3.9/subprocess.py", line 373, in check_call
    raise CalledProcessError(retcode, cmd)
subprocess.CalledProcessError: Command '['/usr/bin/python3', '-m', 'breezy', 'builddeb', '--guess-upstream-branch-url', '--builder=sbuild -A -s -v', '--result-dir=/tmp/janitorzb0x6vri']' returned non-zero exit status 3.

During handling of the above exception, another exception occurred:

Traceback (most recent call last):
  File "/code/ognibuild/ognibuild/debian/build.py", line 224, in build_once
    build(
  File "/code/ognibuild/ognibuild/debian/build.py", line 208, in build
    raise BuildFailedError()
breezy.plugins.debian.builder.BuildFailedError: The build failed.

During handling of the above exception, another exception occurred:

Traceback (most recent call last):
  File "/code/ognibuild/ognibuild/debian/fix_build.py", line 524, in build_incrementally
    return attempt_build(
  File "/code/ognibuild/ognibuild/debian/build.py", line 301, in attempt_build
    return build_once(
  File "/code/ognibuild/ognibuild/debian/build.py", line 239, in build_once
    raise DetailedDebianBuildFailure(
ognibuild.debian.build.DetailedDebianBuildFailure: ('build', ('build',), None, ['sbuild', '-A', '-s', '-v'], MissingCMakeConfig(name='ECM', version='5.91.0'), 'Missing CMake package configuration for ECM (version 5.91.0)')

During handling of the above exception, another exception occurred:

Traceback (most recent call last):
  File "/code/janitor/worker.py", line 1026, in run_worker
    with process_package(
  File "/usr/lib/python3.9/contextlib.py", line 119, in __enter__
    return next(self.gen)
  File "/code/janitor/worker.py", line 789, in process_package
    build_target_details = build_target.build(
  File "/code/janitor/worker.py", line 373, in build
    (changes_names, cl_entry) = build_incrementally(
  File "/code/ognibuild/ognibuild/debian/fix_build.py", line 551, in build_incrementally
    if not resolve_error(e.error, e.phase, fixers):
  File "/code/ognibuild/ognibuild/fix_build.py", line 138, in resolve_error
    if fixer.can_fix(error):
  File "/code/ognibuild/ognibuild/debian/fix_build.py", line 150, in can_fix
    req = problem_to_upstream_requirement(error)
  File "/code/ognibuild/ognibuild/buildlog.py", line 143, in problem_to_upstream_requirement
    return fn(problem)
  File "/code/ognibuild/ognibuild/buildlog.py", line 124, in <lambda>
    [CMakefileRequirement(filename, p.version) for filename in p.filenames])),
AttributeError: 'MissingCMakeConfig' object has no attribute 'filenames'

Publish Blockers

  • ☒ run was not successful
  • ☑ package has not been removed from the archive
  • ☑ command has not changed
  • ☒ not yet reviewed, but review needed
  • ☑ 0 publish attempts so far.not currently attempting to back off
  • ☒ merge proposals for the package maintainer are currently being rate-limited (open: 239, max open: 69)
  • ☒ change set ca6e42ee-9b6d-43d4-9287-04175450c0c5 is working

Full worker log Full build log